Command not found error, VxWorks - VxWorks

This is a discussion on Command not found error, VxWorks - VxWorks ; I m trying to run the simple Helloworld sample code on VxWorks6.1 workbench 2.3...it shows me the error C:\DOCUME~1\ADMINI~1\LOCALS~1\Temp\make21566.sh: command not found: dcc [1] make: *** [SIMPENTIUMdiab_RTP_DEBUG/helloworld.o] Error 1 while building... any help appreciated -aks...

+ Reply to Thread
Results 1 to 2 of 2

Thread: Command not found error, VxWorks

  1. Command not found error, VxWorks

    I m trying to run the simple Helloworld sample code on VxWorks6.1
    workbench 2.3...it shows me the error
    C:\DOCUME~1\ADMINI~1\LOCALS~1\Temp\make21566.sh: command not found: dcc
    [1]
    make: *** [SIMPENTIUMdiab_RTP_DEBUG/helloworld.o] Error 1
    while building...

    any help appreciated
    -aks


  2. Re: Command not found error, VxWorks

    aks wrote:
    > I m trying to run the simple Helloworld sample code on VxWorks6.1
    > workbench 2.3...it shows me the error
    > C:\DOCUME~1\ADMINI~1\LOCALS~1\Temp\make21566.sh: command not found: dcc
    > [1]
    > make: *** [SIMPENTIUMdiab_RTP_DEBUG/helloworld.o] Error 1
    > while building...
    >
    > any help appreciated
    > -aks



    It's telling you it can't find dcc, the Diab compiler driver.
    Have you installed that compiler?


+ Reply to Thread