This is a multi-part message in MIME format.

------=_NextPart_000_027D_01C7B3EF.8C24B500
Content-Type: text/plain;
charset="iso-8859-1"
Content-Transfer-Encoding: quoted-printable

Hi List.

=20

I=92d like to upgrade our running SA to the latest version 3.2.1, using =
cpan
Mail::SpamAssassin.

=20

Install fails, see the output below:

=20

t/spamc_optC................ Not found: reported spam =3D Message
successfully reported/revoked

# Failed test 2 in t/SATest.pm at line 635

Output can be examined in: log/d.spamc_optC/out.1

t/spamc_optC................NOK 2/9 Not found: revoked ham =3D =
Message
successfully reported/revoked

t/spamc_optC................NOK 4/9# Failed test 4 in t/SATest.pm at =
line
635 fail #2

Output can be examined in: log/d.spamc_optC/out.1 log/d.spamc_optC/out.3

Not found: failed to report spam =3D Unable to report/revoke =
message

t/spamc_optC................NOK 6/9# Failed test 6 in t/SATest.pm at =
line
635 fail #3

Output can be examined in: log/d.spamc_optC/out.1 log/d.spamc_optC/out.3
log/d.spamc_optC/out.5

Not found: failed to revoke ham =3D Unable to report/revoke =
message

t/spamc_optC................NOK 8/9# Failed test 8 in t/SATest.pm at =
line
635 fail #4

Output can be examined in: log/d.spamc_optC/out.1 log/d.spamc_optC/out.3
log/d.spamc_optC/out.5 log/d.spamc_optC/out.7

t/spamc_optC................FAILED tests 2, 4, 6, 8

Failed 4/9 tests, 55.56% okay

t/spamc_optL................# Failed test 1 in t/spamc_optL.t at line 20

Not found: learned spam =3D Message successfully un/learned

# Failed test 2 in t/SATest.pm at line 635

Output can be examined in:

t/spamc_optL................NOK 2/16# Failed test 3 in t/spamc_optL.t at
line 24

Not found: already learned spam =3D Message was already =
un/learned

# Failed test 4 in t/SATest.pm at line 635 fail #2

Output can be examined in:

t/spamc_optL................NOK 4/16ERROR: Bayes dump returned an error,
please re-run with -D for more information

# Failed test 5 in t/spamc_optL.t at line 28

Not found: spam in database =3D 1 0 non-token data: nspam

# Failed test 6 in t/SATest.pm at line 635 fail #3

Output can be examined in:

t/spamc_optL................NOK 6/16# Failed test 7 in t/spamc_optL.t at
line 32

Not found: forget spam =3D Message successfully un/learned

# Failed test 8 in t/SATest.pm at line 635 fail #4

t/spamc_optL................NOK 7/16Output can be examined in:

t/spamc_optL................NOK 8/16# Failed test 9 in t/spamc_optL.t at
line 36

Not found: learned ham =3D Message successfully un/learned

# Failed test 10 in t/SATest.pm at line 635 fail #5

Output can be examined in:

t/spamc_optL................NOK 10/16# Failed test 11 in t/spamc_optL.t =
at
line 40

Not found: already learned ham =3D Message was already =
un/learned

# Failed test 12 in t/SATest.pm at line 635 fail #6

Output can be examined in:

t/spamc_optL................NOK 12/16ERROR: Bayes dump returned an =
error,
please re-run with -D for more information

# Failed test 13 in t/spamc_optL.t at line 44

Not found: ham in database =3D 1 0 non-token data: nham

# Failed test 14 in t/SATest.pm at line 635 fail #7

Output can be examined in:

t/spamc_optL................NOK 14/16# Failed test 15 in t/spamc_optL.t =
at
line 48

t/spamc_optL................NOK 15/16 Not found: learned ham =3D =
Message
successfully un/learned

# Failed test 16 in t/SATest.pm at line 635 fail #8

Output can be examined in:

t/spamc_optL................FAILED tests 1-16

Failed 16/16 tests, 0.00% okay

=20

=20

=20

It also hangs for minutes on test

t/spamd_allow_user_rules....ok 1/5

=20

=20

Any ideas what is going wrong?

=20

Regards

Joerg

=20

=20


------=_NextPart_000_027D_01C7B3EF.8C24B500
Content-Type: text/html;
charset="iso-8859-1"
Content-Transfer-Encoding: quoted-printable

xmlns=3D"urn:schemas-microsoft-comfficeffice" =
xmlns:w=3D"urn:schemas-microsoft-comffice:word" =
xmlns=3D"http://www.w3.org/TR/REC-html40">


charset=3Diso-8859-1">









lang=3DEN-GB
style=3D'font-size:12.0pt;font-family:"FrutigerNext LT Light"'>Hi =
List.>>



lang=3DEN-GB
style=3D'font-size:12.0pt;font-family:"FrutigerNext LT =
Light"'>>



lang=3DEN-GB
style=3D'font-size:12.0pt;font-family:"FrutigerNext LT Light"'>I’d =
like to
upgrade our running SA to the latest version 3.2.1, using cpan
Mail::SpamAssassin.>>



lang=3DEN-GB
style=3D'font-size:12.0pt;font-family:"FrutigerNext LT =
Light"'>>



lang=3DEN-GB
style=3D'font-size:12.0pt;font-family:"FrutigerNext LT Light"'>Install =
fails, see
the output below:>>



lang=3DEN-GB
style=3D'font-size:12.0pt;font-family:"FrutigerNext LT =
Light"'>>



lang=3DEN-GB
style=3D'font-size:12.0pt;font-family:"FrutigerNext LT =
Light"'>t/spamc_optC................=A0=A0=A0
Not found: reported spam =3D Message successfully =
reported/revoked>>



lang=3DEN-GB
style=3D'font-size:12.0pt;font-family:"FrutigerNext LT Light"'># Failed =
test 2 in
t/SATest.pm at line 635>>



lang=3DEN-GB
style=3D'font-size:12.0pt;font-family:"FrutigerNext LT Light"'>Output =
can be
examined in: log/d.spamc_optC/out.1>>



lang=3DEN-GB
style=3D'font-size:12.0pt;font-family:"FrutigerNext LT =
Light"'>t/spamc_optC................NOK
2/9=A0=A0=A0=A0 Not found: revoked ham =3D Message successfully =
reported/revoked>>



lang=3DEN-GB
style=3D'font-size:12.0pt;font-family:"FrutigerNext LT =
Light"'>t/spamc_optC................NOK
4/9# Failed test 4 in t/SATest.pm at line 635 fail =
#2>>



lang=3DEN-GB
style=3D'font-size:12.0pt;font-family:"FrutigerNext LT Light"'>Output =
can be
examined in: log/d.spamc_optC/out.1 =
log/d.spamc_optC/out.3>>



lang=3DEN-GB
style=3D'font-size:12.0pt;font-family:"FrutigerNext LT =
Light"'>=A0=A0=A0=A0=A0=A0=A0 Not found:
failed to report spam =3D Unable to report/revoke =
message>>



lang=3DEN-GB
style=3D'font-size:12.0pt;font-family:"FrutigerNext LT =
Light"'>t/spamc_optC................NOK
6/9# Failed test 6 in t/SATest.pm at line 635 fail =
#3>>



lang=3DEN-GB
style=3D'font-size:12.0pt;font-family:"FrutigerNext LT Light"'>Output =
can be
examined in: log/d.spamc_optC/out.1 log/d.spamc_optC/out.3
log/d.spamc_optC/out.5>>



lang=3DEN-GB
style=3D'font-size:12.0pt;font-family:"FrutigerNext LT =
Light"'>=A0=A0=A0=A0=A0=A0=A0 Not found:
failed to revoke ham =3D Unable to report/revoke =
message>>



lang=3DEN-GB
style=3D'font-size:12.0pt;font-family:"FrutigerNext LT =
Light"'>t/spamc_optC................NOK
8/9# Failed test 8 in t/SATest.pm at line 635 fail =
#4>>



lang=3DEN-GB
style=3D'font-size:12.0pt;font-family:"FrutigerNext LT Light"'>Output =
can be
examined in: log/d.spamc_optC/out.1 log/d.spamc_optC/out.3
log/d.spamc_optC/out.5 =
log/d.spamc_optC/out.7>>



lang=3DEN-GB
style=3D'font-size:12.0pt;font-family:"FrutigerNext LT =
Light"'>t/spamc_optC................FAILED
tests 2, 4, 6, 8>>



lang=3DEN-GB
style=3D'font-size:12.0pt;font-family:"FrutigerNext LT =
Light"'>=A0=A0=A0=A0=A0=A0=A0 Failed 4/9
tests, 55.56% okay>>



lang=3DEN-GB
style=3D'font-size:12.0pt;font-family:"FrutigerNext LT =
Light"'>t/spamc_optL................#
Failed test 1 in t/spamc_optL.t at line 20>>



lang=3DEN-GB
style=3D'font-size:12.0pt;font-family:"FrutigerNext LT =
Light"'>=A0=A0=A0=A0=A0=A0=A0 Not found:
learned spam =3D Message successfully =
un/learned>>



lang=3DEN-GB
style=3D'font-size:12.0pt;font-family:"FrutigerNext LT Light"'># Failed =
test 2 in
t/SATest.pm at line 635>>



lang=3DEN-GB
style=3D'font-size:12.0pt;font-family:"FrutigerNext LT Light"'>Output =
can be
examined in:>>



lang=3DEN-GB
style=3D'font-size:12.0pt;font-family:"FrutigerNext LT =
Light"'>t/spamc_optL................NOK
2/16# Failed test 3 in t/spamc_optL.t at line =
24>>



lang=3DEN-GB
style=3D'font-size:12.0pt;font-family:"FrutigerNext LT =
Light"'>=A0=A0=A0=A0=A0=A0=A0 Not found:
already learned spam =3D Message was already =
un/learned>>



lang=3DEN-GB
style=3D'font-size:12.0pt;font-family:"FrutigerNext LT Light"'># Failed =
test 4 in
t/SATest.pm at line 635 fail #2>>



lang=3DEN-GB
style=3D'font-size:12.0pt;font-family:"FrutigerNext LT Light"'>Output =
can be
examined in:>>



lang=3DEN-GB
style=3D'font-size:12.0pt;font-family:"FrutigerNext LT =
Light"'>t/spamc_optL................NOK
4/16ERROR: Bayes dump returned an error, please re-run with -D for more
information>>



lang=3DEN-GB
style=3D'font-size:12.0pt;font-family:"FrutigerNext LT Light"'># Failed =
test 5 in
t/spamc_optL.t at line 28>>



lang=3DEN-GB
style=3D'font-size:12.0pt;font-family:"FrutigerNext LT =
Light"'>=A0=A0=A0=A0=A0=A0=A0 Not found:
spam in database =3D 1 0=A0 non-token data: =
nspam>>



lang=3DEN-GB
style=3D'font-size:12.0pt;font-family:"FrutigerNext LT Light"'># Failed =
test 6 in
t/SATest.pm at line 635 fail #3>>



lang=3DEN-GB
style=3D'font-size:12.0pt;font-family:"FrutigerNext LT Light"'>Output =
can be
examined in:>>



lang=3DEN-GB
style=3D'font-size:12.0pt;font-family:"FrutigerNext LT =
Light"'>t/spamc_optL................NOK
6/16# Failed test 7 in t/spamc_optL.t at line =
32>>



lang=3DEN-GB
style=3D'font-size:12.0pt;font-family:"FrutigerNext LT =
Light"'>=A0=A0=A0=A0=A0=A0=A0 Not found:
forget spam =3D Message successfully =
un/learned>>



lang=3DEN-GB
style=3D'font-size:12.0pt;font-family:"FrutigerNext LT Light"'># Failed =
test 8 in
t/SATest.pm at line 635 fail #4>>



lang=3DEN-GB
style=3D'font-size:12.0pt;font-family:"FrutigerNext LT =
Light"'>t/spamc_optL................NOK
7/16Output can be examined in:>>



lang=3DEN-GB
style=3D'font-size:12.0pt;font-family:"FrutigerNext LT =
Light"'>t/spamc_optL................NOK
8/16# Failed test 9 in t/spamc_optL.t at line =
36>>



lang=3DEN-GB
style=3D'font-size:12.0pt;font-family:"FrutigerNext LT =
Light"'>=A0=A0=A0=A0=A0=A0=A0 Not found:
learned ham =3D Message successfully =
un/learned>>



lang=3DEN-GB
style=3D'font-size:12.0pt;font-family:"FrutigerNext LT Light"'># Failed =
test 10
in t/SATest.pm at line 635 fail #5>>



lang=3DEN-GB
style=3D'font-size:12.0pt;font-family:"FrutigerNext LT Light"'>Output =
can be
examined in:>>



lang=3DEN-GB
style=3D'font-size:12.0pt;font-family:"FrutigerNext LT =
Light"'>t/spamc_optL................NOK
10/16# Failed test 11 in t/spamc_optL.t at line =
40>>



lang=3DEN-GB
style=3D'font-size:12.0pt;font-family:"FrutigerNext LT =
Light"'>=A0=A0=A0=A0=A0=A0=A0 Not found:
already learned ham =3D Message was already =
un/learned>>



lang=3DEN-GB
style=3D'font-size:12.0pt;font-family:"FrutigerNext LT Light"'># Failed =
test 12
in t/SATest.pm at line 635 fail #6>>



lang=3DEN-GB
style=3D'font-size:12.0pt;font-family:"FrutigerNext LT Light"'>Output =
can be
examined in:>>



lang=3DEN-GB
style=3D'font-size:12.0pt;font-family:"FrutigerNext LT =
Light"'>t/spamc_optL................NOK
12/16ERROR: Bayes dump returned an error, please re-run with -D for more
information>>



lang=3DEN-GB
style=3D'font-size:12.0pt;font-family:"FrutigerNext LT Light"'># Failed =
test 13
in t/spamc_optL.t at line 44>>



lang=3DEN-GB
style=3D'font-size:12.0pt;font-family:"FrutigerNext LT =
Light"'>=A0=A0=A0=A0=A0=A0=A0 Not found:
ham in database =3D 1 0=A0 non-token data: =
nham>>



lang=3DEN-GB
style=3D'font-size:12.0pt;font-family:"FrutigerNext LT Light"'># Failed =
test 14
in t/SATest.pm at line 635 fail #7>>



lang=3DEN-GB
style=3D'font-size:12.0pt;font-family:"FrutigerNext LT Light"'>Output =
can be
examined in:>>



lang=3DEN-GB
style=3D'font-size:12.0pt;font-family:"FrutigerNext LT =
Light"'>t/spamc_optL................NOK
14/16# Failed test 15 in t/spamc_optL.t at line =
48>>



lang=3DEN-GB
style=3D'font-size:12.0pt;font-family:"FrutigerNext LT =
Light"'>t/spamc_optL................NOK
15/16=A0=A0 Not found: learned ham =3D Message successfully =
un/learned>>



lang=3DEN-GB
style=3D'font-size:12.0pt;font-family:"FrutigerNext LT Light"'># Failed =
test 16
in t/SATest.pm at line 635 fail #8>>



lang=3DEN-GB
style=3D'font-size:12.0pt;font-family:"FrutigerNext LT Light"'>Output =
can be
examined in:>>



lang=3DEN-GB
style=3D'font-size:12.0pt;font-family:"FrutigerNext LT =
Light"'>t/spamc_optL................FAILED
tests 1-16>>



lang=3DEN-GB
style=3D'font-size:12.0pt;font-family:"FrutigerNext LT =
Light"'>=A0=A0=A0=A0=A0=A0=A0
face=3D"FrutigerNext LT Light"> LT Light"'>Failed
16/16 tests, 0.00% okay>>



style=3D'font-size:12.0pt;font-family:"FrutigerNext LT =
Light"'>>



lang=3DEN-GB
style=3D'font-size:12.0pt;font-family:"FrutigerNext LT =
Light"'>>



lang=3DEN-GB
style=3D'font-size:12.0pt;font-family:"FrutigerNext LT =
Light"'>>



lang=3DEN-GB
style=3D'font-size:12.0pt;font-family:"FrutigerNext LT Light"'>It also =
hangs for
minutes on test>>



lang=3DEN-GB
style=3D'font-size:12.0pt;font-family:"FrutigerNext LT =
Light"'>t/spamd_allow_user_rules....ok
1/5>>



lang=3DEN-GB
style=3D'font-family:"FrutigerNext LT =
Light"'>>



lang=3DEN-GB
style=3D'font-family:"FrutigerNext LT =
Light"'>>



lang=3DEN-GB
style=3D'font-size:12.0pt;font-family:"FrutigerNext LT Light"'>Any ideas =
what is
going wrong?>>



lang=3DEN-GB
style=3D'font-family:"FrutigerNext LT =
Light"'>>



lang=3DEN-GB
style=3D'font-size:12.0pt;font-family:"FrutigerNext LT =
Light"'>Regards>>



lang=3DEN-GB
style=3D'font-size:12.0pt;font-family:"FrutigerNext LT =
Light"'>Joerg>>



lang=3DEN-GB
style=3D'font-family:"FrutigerNext LT =
Light"'>>



lang=3DEN-GB
style=3D'font-family:"FrutigerNext LT =
Light"'>>









------=_NextPart_000_027D_01C7B3EF.8C24B500--