On Mon, 2007-06-11 at 21:09 -0400, Rose, Bobby wrote:
> I'm seeing the same kind of messages mentioned after compiling from
> source on Redhat ES4 and running make test.


I'm wondering if this is the reason:
+ make FULLPERL=/usr/bin/perl test
/usr/bin/perl5.8.7 build/mkrules --exit_on_no_src --src rulesrc --out
rules --manifest MANIFEST --manifestskip MANIFEST.SKIP
no source directory found: exiting

I don't see any other compilation errors. The build process complained
about a few missing packages at the beginning Razor2, Mail:KIM, and
Encode:etect. I was able to install all of those other than
Encode:etect (I can't get the perl-Encode-Detect srpm to recompile,
and I can't figure out what pre-requisites it is missing, since it
complained about not having ExtUtils::CBuilder, but installing that
didn't seem to mollify it).

I built 3.2.0 on this same box just a couple of weeks ago, and didn't
see anything in the release notes, or the bugs that I read, telling me
that I would need to make major changes, so I'm flummoxed.


>
> -----Original Message-----
> From: Daniel J McDonald [mailto:dan.mcdonald@austinenergy.com]
> Sent: Monday, June 11, 2007 6:35 PM
> To: users@spamassassin.apache.org
> Subject: Re: ANNOUNCE: Apache SpamAssassin 3.2.1 available
>
> On Mon, 2007-06-11 at 21:14 +0100, Justin Mason wrote:
> > Apache SpamAssassin 3.2.1 is now available! This is a maintenance and

>
> > security release of the 3.2.x branch. It is highly recommended that
> > people upgrade to this version from 3.2.0.

>
>
> Whilst compiling the RPM for mandriva corporate server 4:
>
> t/spamc_optC................ Not found: reported spam = Message
> successfully reported/revoked
> # Failed test 2 in t/SATest.pm at line 635 Output can be examined in:
> log/d.spamc_optC/out.1
> t/spamc_optC................NOK 2 Not found: revoked ham = Message
> successfully reported/revoked
> # Failed test 4 in t/SATest.pm at line 635 fail #2 Output can be
> examined in: log/d.spamc_optC/out.1 log/d.spamc_optC/out.3
> t/spamc_optC................NOK 4 Not found: failed to report spam
> = Unable to report/revoke message
> [...]
> Output can be examined in: log/d.spamc_optC/out.1 log/d.spamc_optC/out.3
> log/d.spamc_optC/out.5 log/d.spamc_optC/out.7
> t/spamc_optC................FAILED tests 2, 4, 6,
> 8
> Failed 4/9 tests, 55.56% okay
> t/spamc_optL................# Failed test 1 in t/spamc_optL.t at line 20
> Not found: learned spam = Message successfully un/learned [...]
> t/spamc_optL................FAILED tests 1-16
> Failed 16/16 tests, 0.00% okay
>
> Failed Test Stat Wstat Total Fail Failed List of Failed
> ------------------------------------------------------------------------
> -------
> t/spamc_optC.t 9 4 44.44% 2 4 6 8
> t/spamc_optL.t 16 16 100.00% 1-16
> t/spamd_allow_user_rules.t 5 1 20.00% 4
> t/spamd_plugin.t 6 2 33.33% 4 6
> 17 tests skipped.
> Failed 4/129 test scripts, 96.90% okay. 23/1981 subtests failed, 98.84%
> okay.
> make: *** [test_dynamic] Error 255
> error: Bad exit status from /var/tmp/rpm-tmp.45769 (%check)
>
>
> Any thoughts?
> --
> Daniel J McDonald, CCIE # 2495, CISSP # 78281, CNX Austin Energy
> http://www.austinenergy.com
>

--
Daniel J McDonald, CCIE # 2495, CISSP # 78281, CNX
Austin Energy
http://www.austinenergy.com