This is a multi-part message in MIME format.

--===============1793796516==
Content-class: urn:content-classes:message
Content-Type: multipart/alternative;
boundary="----_=_NextPart_001_01C6FF87.4D64086C"

This is a multi-part message in MIME format.

------_=_NextPart_001_01C6FF87.4D64086C
Content-Type: text/plain;
charset="us-ascii"
Content-Transfer-Encoding: quoted-printable

I am attempting an install on RedHat Enterprise Linux 4. First, I have
attempted to uninstall all SNMP/net-snmp stuff from the system as I was
having problems with NetSNMP/default_store trying to load
libnetsnmp.so.5 rather than libnetsnmp.so.10 plus a few other problems.
I did an rpm -e to remove the packages from the system, plus I renamed
all the NetSNMP folders in /usr/lib/perl5 to NetSNMP.old and I have
installed perl 5.8.8 as perl 5.8.5 was installed by default.
=20
I then installed net-snmp-5.3.1 with the following:
=20
../configure --prefix=3D/usr --enable-shared=3Dyes --enable-static=3Dno
--with-perl-modules --with-sys-contact=3Droot@monitor.mygcx.org
--with-default-snmp-version=3D3 --with-sys-location=3D"East Computer RM"
--with-sys-description=3D"GCX monitoring"
--with-logfile=3D/var/log/snmpd.log
--with-persistent-directory=3D/var/net-snmp
make
make test <---- apparently this doesn't test the perl stuff
make install
cd perl/SNMP <---- tests in perl before SNMP seem to work O.K. so
I've cut to the chase
make test
=20
here's the output:
[root@monitor SNMP]# make test
PERL_DL_NONLAZY=3D1 /usr/bin/perl "-MExtUtils::Command::MM" "-e"
"test_harness(0, '../blib/lib', '../blib/arch')" t/*.t
t/async.......ok 1/20# Failed test 3 in t/async.t at line 56

# t/async.t line 56 is: ok(defined($vlist));
Can't call method "tag" on an undefined value at t/async.t line 57.
t/async.......dubious

Test returned status 255 (wstat 65280, 0xff00)
DIED. FAILED tests 3-20
Failed 18/20 tests, 10.00% okay
t/bulkwalk....ok 1/62# Failed test 2 in t/bulkwalk.t at line 52

# t/bulkwalk.t line 52 is: ok($s1->{ErrorNum} =3D=3D 0);
# Failed test 3 in t/bulkwalk.t at line 56
# t/bulkwalk.t line 56 is: ok(scalar @list =3D=3D $expect);
Not an ARRAY reference at t/bulkwalk.t line 57.
t/bulkwalk....dubious

Test returned status 255 (wstat 65280, 0xff00)
DIED. FAILED tests 2-62
Failed 61/62 tests, 1.61% okay
t/conf........ok

t/get.........ok 1/17# Failed test 2 in t/get.t at line 87

# t/get.t line 87 is: ok(!$s1->{ErrorStr} and defined($ret[0]));
# Failed test 3 in t/get.t at line 91
# t/get.t line 91 is: ok($#ret =3D=3D $#{$vars});
t/get.........NOK 3# Failed test 4 in t/get.t at line 98

# t/get.t line 98 is: ok( defined($contact));
t/get.........NOK 4# Failed test 5 in t/get.t at line 103

# t/get.t line 103 is: ok( defined($name));
t/get.........NOK 5# Failed test 6 in t/get.t at line 108

# t/get.t line 108 is: ok( defined($location));
t/get.........NOK 6# Failed test 7 in t/get.t at line 115

# t/get.t line 115 is: ok( defined($ttl));
t/get.........NOK 7# Failed test 8 in t/get.t at line 122

# t/get.t line 122 is: ok( defined($time));
t/get.........NOK 8# Failed test 9 in t/get.t at line 129

# t/get.t line 129 is: ok( defined($totalDatagramsReceived));
t/get.........NOK 9# Failed test 10 in t/get.t at line 136

# t/get.t line 136 is: ok( defined($physaddr));
t/get.........NOK 10# Failed test 11 in t/get.t at line 143

# t/get.t line 143 is: ok( defined($ipaddr));
t/get.........NOK 11# Failed test 12 in t/get.t at line 150

# t/get.t line 150 is: ok( defined($trapOID));
t/get.........NOK 12# Failed test 13 in t/get.t at line 177

# t/get.t line 177 is: ok(defined($time));
t/get.........NOK 13# Failed test 14 in t/get.t at line 189

# t/get.t line 189 is: ok(defined($oid));
t/get.........NOK 14# Failed test 15 in t/get.t at line 195

# t/get.t line 195 is: ok(defined($descr));
t/get.........NOK 15# Failed test 16 in t/get.t at line 201

# t/get.t line 201 is: ok(defined($ifname));
t/get.........FAILED tests 2-16

Failed 15/17 tests, 11.76% okay
t/getnext.....ok 1/9# Failed test 2 in t/getnext.t at line 53

# t/getnext.t line 53 is: ok($s1->{ErrorStr} eq '');
t/getnext.....NOK 2# Failed test 3 in t/getnext.t at line 62

# t/getnext.t line 62 is: ok($s1->{ErrorStr} eq '');
t/getnext.....ok 4/9# Failed test 5 in t/getnext.t at line 87

# t/getnext.t line 87 is: ok((not $s1->{ErrorStr} and not
$s1->{ErrorInd}));
# Failed test 6 in t/getnext.t at line 88
# t/getnext.t line 88 is: ok((defined $var->iid and $var->iid eq 0));
# Failed test 7 in t/getnext.t at line 89
t/getnext.....NOK 5# t/getnext.t line 89 is: ok((defined $var->val and
$var->val eq $res2));
t/getnext.....NOK 7# Failed test 8 in t/getnext.t at line 95

# t/getnext.t line 95 is: ok((defined $var->tag and $var->tag eq
'sysObjectID'));
# Failed test 9 in t/getnext.t at line 96
# t/getnext.t line 96 is: ok((defined $var->val and $var->val eq
$res3));
t/getnext.....FAILED tests 2-3, 5-9

Failed 7/9 tests, 22.22% okay
t/mib.........ok

t/mibload.....ok

t/notify......ok

t/session.....ok

t/set.........ok 1/7Use of uninitialized value in string ne at t/set.t
line 86.
Use of uninitialized value in string ne at t/set.t line 86.
# Failed test 2 in t/set.t at line 86
# t/set.t line 86 is: ok($originalLocation ne $finalvalue);
t/set.........NOK 2Use of uninitialized value in string eq at t/set.t
line 119.
Use of uninitialized value in string eq at t/set.t line 119.
t/set.........ok 3/7Use of uninitialized value in string ne at t/set.t
line 136.
t/set.........ok 5/7netsnmp_assert pss->s_snmp_errno !=3D (-11) failed
snmp_api.c:3124 snmp_build()
Use of uninitialized value in string eq at t/set.t line 205.
Use of uninitialized value in string eq at t/set.t line 205.
t/set.........FAILED test 2

Failed 1/7 tests, 85.71% okay
Failed Test Stat Wstat Total Fail List of Failed
------------------------------------------------------------------------
-------
t/async.t 255 65280 20 35 3-20
t/bulkwalk.t 255 65280 62 120 2-62
t/get.t 17 15 2-16
t/getnext.t 9 7 2-3 5-9
t/set.t 7 1 2
Failed 5/10 test scripts. 102/175 subtests failed.
Files=3D10, Tests=3D175, 225 wallclock secs ( 2.55 cusr + 0.36 csys =3D =
2.91
CPU)
Failed 5/10 test programs. 102/175 subtests failed.
make: *** [test_dynamic] Error 255
[root@monitor SNMP]#=20

------_=_NextPart_001_01C6FF87.4D64086C
Content-Type: text/html;
charset="us-ascii"
Content-Transfer-Encoding: quoted-printable



charset=3Dus-ascii">


I am =
attempting an=20
install on RedHat Enterprise Linux 4. First, I have attempted to =
uninstall all=20
SNMP/net-snmp stuff from the system as I was having problems with=20
NetSNMP/default_store trying to load libnetsnmp.so.5 rather than=20
libnetsnmp.so.10 plus a few other problems. I did an rpm -e to remove =
the=20
packages from the system, plus I renamed all the NetSNMP folders in=20
/usr/lib/perl5 to NetSNMP.old and I have installed perl 5.8.8 as perl =
5.8.5 was=20
installed by default.

class=3D565265819-03112006> 

I then =
installed=20
net-snmp-5.3.1 with the following:

class=3D565265819-03112006> 

class=3D565265819-03112006>./configure=20
--prefix=3D/usr --enable-shared=3Dyes --enable-static=3Dno =
--with-perl-modules href=3D"mailto:--with-sys-contact=3Droot@monitor.mygcx.org">--with-sys-co=
ntact=3Droot@monitor.mygcx.org=20
--with-default-snmp-version=3D3 --with-sys-location=3D"East Computer RM" =

--with-sys-description=3D"GCX monitoring" =
--with-logfile=3D/var/log/snmpd.log=20
--with-persistent-directory=3D/var/net-snmp

class=3D565265819-03112006>make

make=20
test     <---- apparently this doesn't test the =
perl=20
stuff

make=20
install

cd=20
perl/SNMP     <---- tests in perl before SNMP =
seem to=20
work O.K. so I've cut to the chase

make=20
test

class=3D565265819-03112006> 

here's =
the=20
output:

class=3D565265819-03112006>[root@monitor SNMP]#=20
make test
PERL_DL_NONLAZY=3D1 /usr/bin/perl "-MExtUtils::Command::MM" =
"-e"=20
"test_harness(0, '../blib/lib', '../blib/arch')" =
t/*.t
t/async.......ok 1/20#=20
Failed test 3 in t/async.t at line=20
56           &nbsp=
;    =20

#  t/async.t line 56 is:    =20
ok(defined($vlist));
Can't call method "tag" on an undefined value at =

t/async.t line=20
57.
t/async.......dubious       &nb=
sp;           &nbs=
p;           &nbsp=
;            =
           =20

        Test returned status 255 =
(wstat=20
65280, 0xff00)
DIED. FAILED tests=20
3-20
        Failed 18/20 tests, =
10.00%=20
okay
t/bulkwalk....ok 1/62# Failed test 2 in t/bulkwalk.t at line=20
52           &nbsp=
; =20

#  t/bulkwalk.t line 52 is: ok($s1->{ErrorNum} =3D=3D =
0);
# Failed=20
test 3 in t/bulkwalk.t at line 56
#  t/bulkwalk.t line 56 is: =
ok(scalar=20
@list =3D=3D $expect);
Not an ARRAY reference at t/bulkwalk.t line=20
57.
t/bulkwalk....dubious       &nb=
sp;           &nbs=
p;           &nbsp=
;            =
           =20

        Test returned status 255 =
(wstat=20
65280, 0xff00)
DIED. FAILED tests=20
2-62
        Failed 61/62 tests, =
1.61%=20
okay
t/conf........ok        &=
nbsp;           &n=
bsp;           &nb=
sp;           &nbs=
p;           &nbsp=
;   =20

t/get.........ok 1/17# Failed test 2 in t/get.t at line=20
87           &nbsp=
;      =20

#  t/get.t line 87 is: ok(!$s1->{ErrorStr} and=20
defined($ret[0]));
# Failed test 3 in t/get.t at line 91
#  =
t/get.t=20
line 91 is: ok($#ret =3D=3D $#{$vars});
t/get.........NOK 3# Failed =
test 4 in=20
t/get.t at line=20
98           &nbsp=
;        =20

#  t/get.t line 98 is: ok( =
defined($contact));
t/get.........NOK 4#=20
Failed test 5 in t/get.t at line=20
103           &nbs=
p;       =20

#  t/get.t line 103 is: ok( =
defined($name));
t/get.........NOK 5#=20
Failed test 6 in t/get.t at line=20
108           &nbs=
p;       =20

#  t/get.t line 108 is: ok( =
defined($location));
t/get.........NOK=20
6# Failed test 7 in t/get.t at line=20
115           &nbs=
p;       =20

#  t/get.t line 115 is: ok( =
defined($ttl));
t/get.........NOK 7#=20
Failed test 8 in t/get.t at line=20
122           &nbs=
p;       =20

#  t/get.t line 122 is: ok( =
defined($time));
t/get.........NOK 8#=20
Failed test 9 in t/get.t at line=20
129           &nbs=
p;       =20

#  t/get.t line 129 is: ok(=20
defined($totalDatagramsReceived));
t/get.........NOK 9# Failed test =
10 in=20
t/get.t at line=20
136           &nbs=
p;      =20

#  t/get.t line 136 is: ok( =
defined($physaddr));
t/get.........NOK=20
10# Failed test 11 in t/get.t at line=20
143           &nbs=
p;     =20

#  t/get.t line 143 is: ok( =
defined($ipaddr));
t/get.........NOK 11#=20
Failed test 12 in t/get.t at line=20
150           &nbs=
p;     =20

#  t/get.t line 150 is: ok( =
defined($trapOID));
t/get.........NOK=20
12# Failed test 13 in t/get.t at line=20
177           &nbs=
p;     =20

#  t/get.t line 177 is: =
ok(defined($time));
t/get.........NOK 13#=20
Failed test 14 in t/get.t at line=20
189           &nbs=
p;     =20

#  t/get.t line 189 is: ok(defined($oid));
t/get.........NOK =
14#=20
Failed test 15 in t/get.t at line=20
195           &nbs=
p;     =20

#  t/get.t line 195 is: =
ok(defined($descr));
t/get.........NOK 15#=20
Failed test 16 in t/get.t at line=20
201           &nbs=
p;     =20

#  t/get.t line 201 is: =
ok(defined($ifname));
t/get.........FAILED=20
tests=20
2-16           &nb=
sp;           &nbs=
p;           &nbsp=
;         =20

        Failed 15/17 tests, =
11.76%=20
okay
t/getnext.....ok 1/9# Failed test 2 in t/getnext.t at line=20
53           &nbsp=
;   =20

#  t/getnext.t line 53 is: ok($s1->{ErrorStr} eq=20
'');
t/getnext.....NOK 2# Failed test 3 in t/getnext.t at line=20
62           &nbsp=
;    =20

#  t/getnext.t line 62 is: ok($s1->{ErrorStr} eq=20
'');
t/getnext.....ok 4/9# Failed test 5 in t/getnext.t at line=20
87           &nbsp=
;   =20

#  t/getnext.t line 87 is: ok((not $s1->{ErrorStr} and not=20
$s1->{ErrorInd}));
# Failed test 6 in t/getnext.t at line =
88
# =20
t/getnext.t line 88 is: ok((defined $var->iid and $var->iid eq =
0));
#=20
Failed test 7 in t/getnext.t at line 89
t/getnext.....NOK 5# =20
t/getnext.t line 89 is: ok((defined $var->val and $var->val eq=20
$res2));
t/getnext.....NOK 7# Failed test 8 in t/getnext.t at line=20
95           &nbsp=
;    =20

#  t/getnext.t line 95 is: ok((defined $var->tag and =
$var->tag eq=20
'sysObjectID'));
# Failed test 9 in t/getnext.t at line 96
#  =

t/getnext.t line 96 is: ok((defined $var->val and $var->val eq=20
$res3));
t/getnext.....FAILED tests 2-3,=20
5-9           &nbs=
p;           &nbsp=
;            =
     =20

        Failed 7/9 tests, 22.22%=20
okay
t/mib.........ok        &=
nbsp;           &n=
bsp;           &nb=
sp;           &nbs=
p;           &nbsp=
;   =20

t/mibload.....ok        &nbsp=
;            =
            &=
nbsp;           &n=
bsp;           &nb=
sp;  =20

t/notify......ok        &nbsp=
;            =
            &=
nbsp;           &n=
bsp;           &nb=
sp;  =20

t/session.....ok        &nbsp=
;            =
            &=
nbsp;           &n=
bsp;           &nb=
sp;  =20

t/set.........ok 1/7Use of uninitialized value in string ne at =
t/set.t line=20
86.
Use of uninitialized value in string ne at t/set.t line 86.
# =
Failed=20
test 2 in t/set.t at line 86
#  t/set.t line 86 is: =
ok($originalLocation=20
ne $finalvalue);
t/set.........NOK 2Use of uninitialized value in =
string eq=20
at t/set.t line 119.
Use of uninitialized value in string eq at =
t/set.t line=20
119.
t/set.........ok 3/7Use of uninitialized value in string ne at =
t/set.t=20
line 136.
t/set.........ok 5/7netsnmp_assert pss->s_snmp_errno =
!=3D (-11)=20
failed snmp_api.c:3124 snmp_build()
Use of uninitialized value in =
string eq=20
at t/set.t line 205.
Use of uninitialized value in string eq at =
t/set.t line=20
205.
t/set.........FAILED test=20
2            =
            &=
nbsp;           &n=
bsp;           &nb=
sp;=20

        Failed 1/7 tests, 85.71%=20
okay
Failed Test  Stat Wstat Total Fail  List of=20
Failed
---------------------------------------------------------------=
----------------
t/async.t    =20
255 65280    20   35  =
3-20
t/bulkwalk.t =20
255 65280    62  120 =20
2-62
t/get.t         &nbs=
p;         =20
17   15 =20
2-16
t/getnext.t         =
       =20
9    7  2-3=20
5-9
t/set.t         &nbsp=
;          =20
7    1  2
Failed 5/10 test scripts. 102/175 =
subtests=20
failed.
Files=3D10, Tests=3D175, 225 wallclock secs ( 2.55 cusr =
+  0.36 csys=20
=3D  2.91 CPU)
Failed 5/10 test programs. 102/175 subtests=20
failed.
make: *** [test_dynamic] Error 255
[root@monitor SNMP]#=20


------_=_NextPart_001_01C6FF87.4D64086C--


--===============1793796516==
Content-Type: text/plain; charset="us-ascii"
MIME-Version: 1.0
Content-Transfer-Encoding: 7bit
Content-Disposition: inline

-------------------------------------------------------------------------
Using Tomcat but need to do more? Need to support web services, security?
Get stuff done quickly with pre-integrated technology to make your job easier
Download IBM WebSphere Application Server v.1.0.1 based on Apache Geronimo
http://sel.as-us.falkag.net/sel?cmd=...057&dat=121642
--===============1793796516==
Content-Type: text/plain; charset="us-ascii"
MIME-Version: 1.0
Content-Transfer-Encoding: 7bit
Content-Disposition: inline

_______________________________________________
Net-snmp-users mailing list
Net-snmp-users@lists.sourceforge.net
Please see the following page to unsubscribe or change other options:
https://lists.sourceforge.net/lists/...net-snmp-users

--===============1793796516==--