I pulled the latest tcl/tk 8.4.14 and tcl compilies
without problems. The 'make test' in tcl complains of
some issue with clock and '%k', but I'm not worried about
that one. Configure and make for tk run without issues.
When I do the 'make test' I get errors complaining about
'ambiguous ... rectangle' and 'ambiguous ... image'.

Any idea what's going on here?

tcl/tk 8.4.14
IRIX64

$ CC=/usr/bin/cc ./configure --prefix=/usr/freeware --with-tcl=../../tcl8.4.14/unix
$ make
$ make test
bind.test

==== bind-6.1 Tk_DeleteBindTable procedure FAILED
==== Contents of test case:

catch {destroy .b.c}
canvas .b.c
.b.c bind foo <1> {string 1}
.b.c create rectangle 0 0 100 100
.b.c bind 1 <2> {string 2}
destroy .b.c

---- Test generated error; Return code was: 1
---- Return code should have been one of: 0 2
---- errorInfo: unknown or ambiguous item type "rectangle"
while executing
".b.c create rectangle 0 0 100 100"
("uplevel" body line 5)
invoked from within
"uplevel 1 $script"
---- errorCode: NONE
==== bind-6.1 FAILED


==== bind-24.14 FindSequence procedure: no binding FAILED
==== Contents of test case:

catch {destroy .b.f}
canvas .b.f
set i [.b.f create rect 10 10 100 100]
list [catch {.b.f bind $i } msg] $msg

---- Test generated error; Return code was: 1
---- Return code should have been one of: 0 2
---- errorInfo: unknown or ambiguous item type "rect"
while executing
".b.f create rect 10 10 100 100"
invoked from within
"set i [.b.f create rect 10 10 100 100]"
("uplevel" body line 4)
invoked from within
"uplevel 1 $script"
---- errorCode: NONE
==== bind-24.14 FAILED


Mike