This is a multi-part message in MIME format...

------------=_1182413415-96617-1
Content-Type: text/plain; charset="utf-8"
Content-Transfer-Encoding: quoted-printable

OpenSSL Version: 0.9.9-dev SNAP 20070621
OS. Linux/x86_64/Fedora 7

1. make report testlog attached
2. Getting segfault when running make tests during big number library tes=
t.
.....
test BN_mont
*** glibc detected *** ./bntest: free(): invalid next size (fast):=20
0x00000000006ce600 ***
=3D=3D=3D=3D=3D=3D=3D Backtrace: =3D=3D=3D=3D=3D=3D=3D=3D=3D
/lib64/libc.so.6[0x3040470412]
/lib64/libc.so.6(cfree+0x8c)[0x3040473b1c]
../bntest[0x41bb6d]
../bntest[0x40959d]
../bntest[0x41202d]
../bntest[0x404864]
../bntest[0x405b6c]
/lib64/libc.so.6(__libc_start_main+0xf4)[0x304041daa4]
../bntest(realloc+0xd1)[0x4015a9]
=3D=3D=3D=3D=3D=3D=3D Memory map: =3D=3D=3D=3D=3D=3D=3D=3D
00400000-004b4000 r-xp 00000000 fd:05 2018295 =20
/home/PROJECTS/Crypto/openssl/openssl.puck/test/bntest
006b3000-006cb000 rwxp 000b3000 fd:05 2018295 =20
/home/PROJECTS/Crypto/openssl/openssl.puck/test/bntest
006cb000-006ee000 rwxp 006cb000 00:00 0 =20
[heap]
303f200000-303f21a000 r-xp 00000000 fd:03 951992 =20
/lib64/ld-2.6.so
303f419000-303f41a000 r-xp 00019000 fd:03 951992 =20
/lib64/ld-2.6.so
303f41a000-303f41b000 rwxp 0001a000 fd:03 951992 =20
/lib64/ld-2.6.so
3040400000-3040547000 r-xp 00000000 fd:03 952079 =20
/lib64/libc-2.6.so
3040547000-3040746000 ---p 00147000 fd:03 952079 =20
/lib64/libc-2.6.so
3040746000-304074a000 r-xp 00146000 fd:03 952079 =20
/lib64/libc-2.6.so
304074a000-304074b000 rwxp 0014a000 fd:03 952079 =20
/lib64/libc-2.6.so
304074b000-3040750000 rwxp 304074b000 00:00 0
3040c00000-3040c02000 r-xp 00000000 fd:03 950444 =20
/lib64/libdl-2.6.so
3040c02000-3040e02000 ---p 00002000 fd:03 950444 =20
/lib64/libdl-2.6.so
3040e02000-3040e03000 r-xp 00002000 fd:03 950444 =20
/lib64/libdl-2.6.so
3040e03000-3040e04000 rwxp 00003000 fd:03 950444 =20
/lib64/libdl-2.6.so
304c600000-304c60d000 r-xp 00000000 fd:03 952097 =20
/lib64/libgcc_s-4.1.2-20070503.so.1
304c60d000-304c80d000 ---p 0000d000 fd:03 952097 =20
/lib64/libgcc_s-4.1.2-20070503.so.1
304c80d000-304c80e000 rwxp 0000d000 fd:03 952097 =20
/lib64/libgcc_s-4.1.2-20070503.so.1
2aaaaaaab000-2aaaaaaad000 rwxp 2aaaaaaab000 00:00 0
2aaaaaacb000-2aaaaaacd000 rwxp 2aaaaaacb000 00:00 0
2aaaac000000-2aaaac021000 rwxp 2aaaac000000 00:00 0
2aaaac021000-2aaab0000000 ---p 2aaaac021000 00:00 0
7fffdff9b000-7fffdffb0000 rwxp 7fffdff9b000 00:00 0 =20
[stack]
ffffffffff600000-ffffffffff601000 r-xp 00000000 00:00 0 =20
[vdso]
/bin/sh: line 1: 20159 Aborted ../util/shlib_wrap.sh=20
../bntest > tmp.bntest
make[2]: *** [test_bn] Error 134
make[2]: Leaving directory `/home/PROJECTS/Crypto/openssl/openssl.puck/te=
st'
make[1]: *** [tests] Error 2
make[1]: Leaving directory `/home/PROJECTS/Crypto/openssl/openssl.puck'

OpenSSL self-test report:

OpenSSL version: 0.9.9-dev
Last change: Final changes to avoid use of pointer pointer casts in =
....
Options: no-gmp no-krb5 no-mdc2 no-rc5 no-rfc3779 no-shared=20
no-zlib no-zlib-dynamic
OS (uname): Linux satya 2.6.21-1.3228.fc7 #1 SMP Tue Jun 12=20
14:56:37 EDT 2007 x86_64 x86_64 x86_64 GNU/Linux
OS (config): x86_64-whatever-linux2
Target (default): linux-x86_64
Target: linux-x86_64
Compiler: Using built-in specs.
Target: x86_64-redhat-linux
Configured with: ../configure --prefix=3D/usr --mandir=3D/usr/share/man=20
--infodir=3D/usr/share/info --enable-shared --enable-threads=3Dposix=20
--enable-checking=3Drelease --with-system-zlib --enable-__cxa_atexit=20
--disable-libunwind-exceptions=20
--enable-languages=3Dc,c++,objc,obj-c++,java,fortran,ada=20
--enable-java-awt=3Dgtk --disable-dssi --enable-plugin=20
--with-java-home=3D/usr/lib/jvm/java-1.5.0-gcj-1.5.0.0/jre=20
--enable-libgcj-multifile --enable-java-maintainer-mode=20
--with-ecj-jar=3D/usr/share/java/eclipse-ecj.jar --with-cpu=3Dgeneric=20
--host=3Dx86_64-redhat-linux
Thread model: posix
gcc version 4.1.2 20070502 (Red Hat 4.1.2-12)

Failure!
[...]

Test report in file testlog




------------=_1182413415-96617-1
Content-Type: text/plain; charset="ascii"; name="testlog"
Content-Disposition: inline; filename="testlog"
Content-Transfer-Encoding: 7bit
RT-Attachment: 1549/16858/6865

OpenSSL self-test report:

OpenSSL version: 0.9.9-dev
Last change: Final changes to avoid use of pointer pointer casts in ...
Options: no-gmp no-krb5 no-mdc2 no-rc5 no-rfc3779 no-shared no-zlib no-zlib-dynamic
OS (uname): Linux satya 2.6.21-1.3228.fc7 #1 SMP Tue Jun 12 14:56:37 EDT 2007 x86_64 x86_64 x86_64 GNU/Linux
OS (config): x86_64-whatever-linux2
Target (default): linux-x86_64
Target: linux-x86_64
Compiler: Using built-in specs.
Target: x86_64-redhat-linux
Configured with: ../configure --prefix=/usr --mandir=/usr/share/man --infodir=/usr/share/info --enable-shared --enable-threads=posix --enable-checking=release --with-system-zlib --enable-__cxa_atexit --disable-libunwind-exceptions --enable-languages=c,c++,objc,obj-c++,java,fortran,ada --enable-java-awt=gtk --disable-dssi --enable-plugin --with-java-home=/usr/lib/jvm/java-1.5.0-gcj-1.5.0.0/jre --enable-libgcj-multifile --enable-java-maintainer-mode --with-ecj-jar=/usr/share/java/eclipse-ecj.jar --with-cpu=generic --host=x86_64-redhat-linux
Thread model: posix
gcc version 4.1.2 20070502 (Red Hat 4.1.2-12)

Failure!
-----------------------------------------------------------------------------
make[1]: Entering directory `/home/PROJECTS/Crypto/openssl/openssl.puck'
making all in crypto...
make[2]: Entering directory `/home/PROJECTS/Crypto/openssl/openssl.puck/crypto'
making all in crypto/objects...
make[3]: Entering directory `/home/PROJECTS/Crypto/openssl/openssl.puck/crypto/objects'
make[3]: Nothing to be done for `all'.
make[3]: Leaving directory `/home/PROJECTS/Crypto/openssl/openssl.puck/crypto/objects'
making all in crypto/md2...
make[3]: Entering directory `/home/PROJECTS/Crypto/openssl/openssl.puck/crypto/md2'
make[3]: Nothing to be done for `all'.
make[3]: Leaving directory `/home/PROJECTS/Crypto/openssl/openssl.puck/crypto/md2'
making all in crypto/md4...
make[3]: Entering directory `/home/PROJECTS/Crypto/openssl/openssl.puck/crypto/md4'
make[3]: Nothing to be done for `all'.
make[3]: Leaving directory `/home/PROJECTS/Crypto/openssl/openssl.puck/crypto/md4'
making all in crypto/md5...
make[3]: Entering directory `/home/PROJECTS/Crypto/openssl/openssl.puck/crypto/md5'
make[3]: Nothing to be done for `all'.
make[3]: Leaving directory `/home/PROJECTS/Crypto/openssl/openssl.puck/crypto/md5'
making all in crypto/sha...
make[3]: Entering directory `/home/PROJECTS/Crypto/openssl/openssl.puck/crypto/sha'
make[3]: Nothing to be done for `all'.
make[3]: Leaving directory `/home/PROJECTS/Crypto/openssl/openssl.puck/crypto/sha'
making all in crypto/hmac...
make[3]: Entering directory `/home/PROJECTS/Crypto/openssl/openssl.puck/crypto/hmac'
make[3]: Nothing to be done for `all'.
make[3]: Leaving directory `/home/PROJECTS/Crypto/openssl/openssl.puck/crypto/hmac'
making all in crypto/ripemd...
make[3]: Entering directory `/home/PROJECTS/Crypto/openssl/openssl.puck/crypto/ripemd'
make[3]: Nothing to be done for `all'.
make[3]: Leaving directory `/home/PROJECTS/Crypto/openssl/openssl.puck/crypto/ripemd'
making all in crypto/whrlpool...
make[3]: Entering directory `/home/PROJECTS/Crypto/openssl/openssl.puck/crypto/whrlpool'
make[3]: Nothing to be done for `all'.
make[3]: Leaving directory `/home/PROJECTS/Crypto/openssl/openssl.puck/crypto/whrlpool'
making all in crypto/des...
make[3]: Entering directory `/home/PROJECTS/Crypto/openssl/openssl.puck/crypto/des'
make[3]: Nothing to be done for `all'.
make[3]: Leaving directory `/home/PROJECTS/Crypto/openssl/openssl.puck/crypto/des'
making all in crypto/aes...
make[3]: Entering directory `/home/PROJECTS/Crypto/openssl/openssl.puck/crypto/aes'
make[3]: Nothing to be done for `all'.
make[3]: Leaving directory `/home/PROJECTS/Crypto/openssl/openssl.puck/crypto/aes'
making all in crypto/rc2...
make[3]: Entering directory `/home/PROJECTS/Crypto/openssl/openssl.puck/crypto/rc2'
make[3]: Nothing to be done for `all'.
make[3]: Leaving directory `/home/PROJECTS/Crypto/openssl/openssl.puck/crypto/rc2'
making all in crypto/rc4...
make[3]: Entering directory `/home/PROJECTS/Crypto/openssl/openssl.puck/crypto/rc4'
make[3]: Nothing to be done for `all'.
make[3]: Leaving directory `/home/PROJECTS/Crypto/openssl/openssl.puck/crypto/rc4'
making all in crypto/idea...
make[3]: Entering directory `/home/PROJECTS/Crypto/openssl/openssl.puck/crypto/idea'
make[3]: Nothing to be done for `all'.
make[3]: Leaving directory `/home/PROJECTS/Crypto/openssl/openssl.puck/crypto/idea'
making all in crypto/bf...
make[3]: Entering directory `/home/PROJECTS/Crypto/openssl/openssl.puck/crypto/bf'
make[3]: Nothing to be done for `all'.
make[3]: Leaving directory `/home/PROJECTS/Crypto/openssl/openssl.puck/crypto/bf'
making all in crypto/cast...
make[3]: Entering directory `/home/PROJECTS/Crypto/openssl/openssl.puck/crypto/cast'
make[3]: Nothing to be done for `all'.
make[3]: Leaving directory `/home/PROJECTS/Crypto/openssl/openssl.puck/crypto/cast'
making all in crypto/camellia...
make[3]: Entering directory `/home/PROJECTS/Crypto/openssl/openssl.puck/crypto/camellia'
make[3]: Nothing to be done for `all'.
make[3]: Leaving directory `/home/PROJECTS/Crypto/openssl/openssl.puck/crypto/camellia'
making all in crypto/seed...
make[3]: Entering directory `/home/PROJECTS/Crypto/openssl/openssl.puck/crypto/seed'
make[3]: Nothing to be done for `all'.
make[3]: Leaving directory `/home/PROJECTS/Crypto/openssl/openssl.puck/crypto/seed'
making all in crypto/bn...
make[3]: Entering directory `/home/PROJECTS/Crypto/openssl/openssl.puck/crypto/bn'
make[3]: Nothing to be done for `all'.
make[3]: Leaving directory `/home/PROJECTS/Crypto/openssl/openssl.puck/crypto/bn'
making all in crypto/ec...
make[3]: Entering directory `/home/PROJECTS/Crypto/openssl/openssl.puck/crypto/ec'
make[3]: Nothing to be done for `all'.
make[3]: Leaving directory `/home/PROJECTS/Crypto/openssl/openssl.puck/crypto/ec'
making all in crypto/rsa...
make[3]: Entering directory `/home/PROJECTS/Crypto/openssl/openssl.puck/crypto/rsa'
make[3]: Nothing to be done for `all'.
make[3]: Leaving directory `/home/PROJECTS/Crypto/openssl/openssl.puck/crypto/rsa'
making all in crypto/dsa...
make[3]: Entering directory `/home/PROJECTS/Crypto/openssl/openssl.puck/crypto/dsa'
make[3]: Nothing to be done for `all'.
make[3]: Leaving directory `/home/PROJECTS/Crypto/openssl/openssl.puck/crypto/dsa'
making all in crypto/ecdsa...
make[3]: Entering directory `/home/PROJECTS/Crypto/openssl/openssl.puck/crypto/ecdsa'
make[3]: Nothing to be done for `all'.
make[3]: Leaving directory `/home/PROJECTS/Crypto/openssl/openssl.puck/crypto/ecdsa'
making all in crypto/dh...
make[3]: Entering directory `/home/PROJECTS/Crypto/openssl/openssl.puck/crypto/dh'
make[3]: Nothing to be done for `all'.
make[3]: Leaving directory `/home/PROJECTS/Crypto/openssl/openssl.puck/crypto/dh'
making all in crypto/ecdh...
make[3]: Entering directory `/home/PROJECTS/Crypto/openssl/openssl.puck/crypto/ecdh'
make[3]: Nothing to be done for `all'.
make[3]: Leaving directory `/home/PROJECTS/Crypto/openssl/openssl.puck/crypto/ecdh'
making all in crypto/dso...
make[3]: Entering directory `/home/PROJECTS/Crypto/openssl/openssl.puck/crypto/dso'
make[3]: Nothing to be done for `all'.
make[3]: Leaving directory `/home/PROJECTS/Crypto/openssl/openssl.puck/crypto/dso'
making all in crypto/engine...
make[3]: Entering directory `/home/PROJECTS/Crypto/openssl/openssl.puck/crypto/engine'
make[3]: Nothing to be done for `all'.
make[3]: Leaving directory `/home/PROJECTS/Crypto/openssl/openssl.puck/crypto/engine'
making all in crypto/buffer...
make[3]: Entering directory `/home/PROJECTS/Crypto/openssl/openssl.puck/crypto/buffer'
make[3]: Nothing to be done for `all'.
make[3]: Leaving directory `/home/PROJECTS/Crypto/openssl/openssl.puck/crypto/buffer'
making all in crypto/bio...
make[3]: Entering directory `/home/PROJECTS/Crypto/openssl/openssl.puck/crypto/bio'
make[3]: Nothing to be done for `all'.
make[3]: Leaving directory `/home/PROJECTS/Crypto/openssl/openssl.puck/crypto/bio'
making all in crypto/stack...
make[3]: Entering directory `/home/PROJECTS/Crypto/openssl/openssl.puck/crypto/stack'
make[3]: Nothing to be done for `all'.
make[3]: Leaving directory `/home/PROJECTS/Crypto/openssl/openssl.puck/crypto/stack'
making all in crypto/lhash...
make[3]: Entering directory `/home/PROJECTS/Crypto/openssl/openssl.puck/crypto/lhash'
make[3]: Nothing to be done for `all'.
make[3]: Leaving directory `/home/PROJECTS/Crypto/openssl/openssl.puck/crypto/lhash'
making all in crypto/rand...
make[3]: Entering directory `/home/PROJECTS/Crypto/openssl/openssl.puck/crypto/rand'
make[3]: Nothing to be done for `all'.
make[3]: Leaving directory `/home/PROJECTS/Crypto/openssl/openssl.puck/crypto/rand'
making all in crypto/err...
make[3]: Entering directory `/home/PROJECTS/Crypto/openssl/openssl.puck/crypto/err'
make[3]: Nothing to be done for `all'.
make[3]: Leaving directory `/home/PROJECTS/Crypto/openssl/openssl.puck/crypto/err'
making all in crypto/evp...
make[3]: Entering directory `/home/PROJECTS/Crypto/openssl/openssl.puck/crypto/evp'
make[3]: Nothing to be done for `all'.
make[3]: Leaving directory `/home/PROJECTS/Crypto/openssl/openssl.puck/crypto/evp'
making all in crypto/asn1...
make[3]: Entering directory `/home/PROJECTS/Crypto/openssl/openssl.puck/crypto/asn1'
make[3]: Nothing to be done for `all'.
make[3]: Leaving directory `/home/PROJECTS/Crypto/openssl/openssl.puck/crypto/asn1'
making all in crypto/pem...
make[3]: Entering directory `/home/PROJECTS/Crypto/openssl/openssl.puck/crypto/pem'
make[3]: Nothing to be done for `all'.
make[3]: Leaving directory `/home/PROJECTS/Crypto/openssl/openssl.puck/crypto/pem'
making all in crypto/x509...
make[3]: Entering directory `/home/PROJECTS/Crypto/openssl/openssl.puck/crypto/x509'
make[3]: Nothing to be done for `all'.
make[3]: Leaving directory `/home/PROJECTS/Crypto/openssl/openssl.puck/crypto/x509'
making all in crypto/x509v3...
make[3]: Entering directory `/home/PROJECTS/Crypto/openssl/openssl.puck/crypto/x509v3'
make[3]: Nothing to be done for `all'.
make[3]: Leaving directory `/home/PROJECTS/Crypto/openssl/openssl.puck/crypto/x509v3'
making all in crypto/conf...
make[3]: Entering directory `/home/PROJECTS/Crypto/openssl/openssl.puck/crypto/conf'
make[3]: Nothing to be done for `all'.
make[3]: Leaving directory `/home/PROJECTS/Crypto/openssl/openssl.puck/crypto/conf'
making all in crypto/txt_db...
make[3]: Entering directory `/home/PROJECTS/Crypto/openssl/openssl.puck/crypto/txt_db'
make[3]: Nothing to be done for `all'.
make[3]: Leaving directory `/home/PROJECTS/Crypto/openssl/openssl.puck/crypto/txt_db'
making all in crypto/pkcs7...
make[3]: Entering directory `/home/PROJECTS/Crypto/openssl/openssl.puck/crypto/pkcs7'
make[3]: Nothing to be done for `all'.
make[3]: Leaving directory `/home/PROJECTS/Crypto/openssl/openssl.puck/crypto/pkcs7'
making all in crypto/pkcs12...
make[3]: Entering directory `/home/PROJECTS/Crypto/openssl/openssl.puck/crypto/pkcs12'
make[3]: Nothing to be done for `all'.
make[3]: Leaving directory `/home/PROJECTS/Crypto/openssl/openssl.puck/crypto/pkcs12'
making all in crypto/comp...
make[3]: Entering directory `/home/PROJECTS/Crypto/openssl/openssl.puck/crypto/comp'
make[3]: Nothing to be done for `all'.
make[3]: Leaving directory `/home/PROJECTS/Crypto/openssl/openssl.puck/crypto/comp'
making all in crypto/ocsp...
make[3]: Entering directory `/home/PROJECTS/Crypto/openssl/openssl.puck/crypto/ocsp'
make[3]: Nothing to be done for `all'.
make[3]: Leaving directory `/home/PROJECTS/Crypto/openssl/openssl.puck/crypto/ocsp'
making all in crypto/ui...
make[3]: Entering directory `/home/PROJECTS/Crypto/openssl/openssl.puck/crypto/ui'
make[3]: Nothing to be done for `all'.
make[3]: Leaving directory `/home/PROJECTS/Crypto/openssl/openssl.puck/crypto/ui'
making all in crypto/krb5...
make[3]: Entering directory `/home/PROJECTS/Crypto/openssl/openssl.puck/crypto/krb5'
make[3]: Nothing to be done for `all'.
make[3]: Leaving directory `/home/PROJECTS/Crypto/openssl/openssl.puck/crypto/krb5'
making all in crypto/store...
make[3]: Entering directory `/home/PROJECTS/Crypto/openssl/openssl.puck/crypto/store'
make[3]: Nothing to be done for `all'.
make[3]: Leaving directory `/home/PROJECTS/Crypto/openssl/openssl.puck/crypto/store'
making all in crypto/pqueue...
make[3]: Entering directory `/home/PROJECTS/Crypto/openssl/openssl.puck/crypto/pqueue'
make[3]: Nothing to be done for `all'.
make[3]: Leaving directory `/home/PROJECTS/Crypto/openssl/openssl.puck/crypto/pqueue'
making all in crypto/ts...
make[3]: Entering directory `/home/PROJECTS/Crypto/openssl/openssl.puck/crypto/ts'
make[3]: Nothing to be done for `all'.
make[3]: Leaving directory `/home/PROJECTS/Crypto/openssl/openssl.puck/crypto/ts'
if [ -n "" ]; then \
(cd ..; make libcrypto.so.0.9.9); \
fi
make[2]: Leaving directory `/home/PROJECTS/Crypto/openssl/openssl.puck/crypto'
making all in ssl...
make[2]: Entering directory `/home/PROJECTS/Crypto/openssl/openssl.puck/ssl'
if [ -n "" ]; then \
(cd ..; make libssl.so.0.9.9); \
fi
make[2]: Leaving directory `/home/PROJECTS/Crypto/openssl/openssl.puck/ssl'
making all in engines...
make[2]: Entering directory `/home/PROJECTS/Crypto/openssl/openssl.puck/engines'
echo ccgost
ccgost
making all in engines/ccgost...
make[3]: Entering directory `/home/PROJECTS/Crypto/openssl/openssl.puck/engines/ccgost'
make[3]: Nothing to be done for `all'.
make[3]: Leaving directory `/home/PROJECTS/Crypto/openssl/openssl.puck/engines/ccgost'
make[2]: Leaving directory `/home/PROJECTS/Crypto/openssl/openssl.puck/engines'
making all in apps...
make[2]: Entering directory `/home/PROJECTS/Crypto/openssl/openssl.puck/apps'
make[2]: Nothing to be done for `all'.
make[2]: Leaving directory `/home/PROJECTS/Crypto/openssl/openssl.puck/apps'
making all in test...
make[2]: Entering directory `/home/PROJECTS/Crypto/openssl/openssl.puck/test'
make[2]: Nothing to be done for `all'.
make[2]: Leaving directory `/home/PROJECTS/Crypto/openssl/openssl.puck/test'
making all in tools...
make[2]: Entering directory `/home/PROJECTS/Crypto/openssl/openssl.puck/tools'
make[2]: Nothing to be done for `all'.
make[2]: Leaving directory `/home/PROJECTS/Crypto/openssl/openssl.puck/tools'
make[1]: Leaving directory `/home/PROJECTS/Crypto/openssl/openssl.puck'
-----------------------------------------------------------------------------
make[1]: Entering directory `/home/PROJECTS/Crypto/openssl/openssl.puck'
testing...
make[2]: Entering directory `/home/PROJECTS/Crypto/openssl/openssl.puck/test'
make[3]: Entering directory `/home/PROJECTS/Crypto/openssl/openssl.puck'
making all in apps...
make[4]: Entering directory `/home/PROJECTS/Crypto/openssl/openssl.puck/apps'
make[4]: Nothing to be done for `all'.
make[4]: Leaving directory `/home/PROJECTS/Crypto/openssl/openssl.puck/apps'
make[3]: Leaving directory `/home/PROJECTS/Crypto/openssl/openssl.puck'
.../util/shlib_wrap.sh ./destest
Doing cbcm
Doing ecb
Doing ede ecb
Doing cbc
Doing desx cbc
Doing ede cbc
Doing pcbc
Doing cfb8 cfb16 cfb32 cfb48 cfb64 cfb64() ede_cfb64() done
Doing ofb
Doing ofb64
Doing ede_ofb64
Doing cbc_cksum
Doing quad_cksum
input word alignment test 0 1 2 3
output word alignment test 0 1 2 3
fast crypt test
.../util/shlib_wrap.sh ./ideatest
ecb idea ok
cbc idea ok
cfb64 idea ok
.../util/shlib_wrap.sh ./shatest
test 1 ok
test 2 ok
test 3 ok
.../util/shlib_wrap.sh ./sha1test
test 1 ok
test 2 ok
test 3 ok
.../util/shlib_wrap.sh ./sha256t
Testing SHA-256 ... passed.
Testing SHA-224 ... passed.
.../util/shlib_wrap.sh ./sha512t
Testing SHA-512 ... passed.
Testing SHA-384 ... passed.
.../util/shlib_wrap.sh ./md4test
test 1 ok
test 2 ok
test 3 ok
test 4 ok
test 5 ok
test 6 ok
test 7 ok
.../util/shlib_wrap.sh ./md5test
test 1 ok
test 2 ok
test 3 ok
test 4 ok
test 5 ok
test 6 ok
test 7 ok
.../util/shlib_wrap.sh ./hmactest
test 0 ok
test 1 ok
test 2 ok
test 3 ok
.../util/shlib_wrap.sh ./md2test
test 1 ok
test 2 ok
test 3 ok
test 4 ok
test 5 ok
test 6 ok
test 7 ok
.../util/shlib_wrap.sh ./mdc2test
No MDC2 support
.../util/shlib_wrap.sh ./wp_test
Testing Whirlpool ......... passed.
.../util/shlib_wrap.sh ./rmdtest
test 1 ok
test 2 ok
test 3 ok
test 4 ok
test 5 ok
test 6 ok
test 7 ok
test 8 ok
.../util/shlib_wrap.sh ./rc2test
ecb RC2 ok
.../util/shlib_wrap.sh ./rc4test
test 0 ok
test 1 ok
test 2 ok
test 3 ok
test 4 ok
test 5 ok
test end processing ....................done
test multi-call ....................done
bulk test ok
.../util/shlib_wrap.sh ./rc5test
No RC5 support
.../util/shlib_wrap.sh ./bftest
testing blowfish in raw ecb mode
testing blowfish in ecb mode
testing blowfish set_key
testing blowfish in cbc mode
testing blowfish in cfb64 mode
testing blowfish in ofb64
.../util/shlib_wrap.sh ./casttest
ecb cast5 ok
This test will take some time....123456789ABCDEF ok
.../util/shlib_wrap.sh ./randtest
test 1 done
test 2 done
test 3 done
test 4 done
starting big number library test, could take a while...
test BN_add
test BN_sub
test BN_lshift1
test BN_lshift (fixed)
test BN_lshift
test BN_rshift1
test BN_rshift
test BN_sqr
test BN_mul
test BN_div
test BN_div_word
test BN_div_recp
test BN_mod
test BN_mod_mul
test BN_mont
/bin/sh: line 1: 20159 Aborted ../util/shlib_wrap.sh ./bntest > tmp.bntest
make[2]: *** [test_bn] Error 134
make[2]: Leaving directory `/home/PROJECTS/Crypto/openssl/openssl.puck/test'
make[1]: *** [tests] Error 2
make[1]: Leaving directory `/home/PROJECTS/Crypto/openssl/openssl.puck'
-----------------------------------------------------------------------------

------------=_1182413415-96617-1--
__________________________________________________ ____________________
OpenSSL Project http://www.openssl.org
Development Mailing List openssl-dev@openssl.org
Automated List Manager majordomo@openssl.org