------=_Part_9596_7954937.1119515225582
Content-Type: text/plain; charset=ISO-8859-1
Content-Transfer-Encoding: quoted-printable
Content-Disposition: inline

Hi all

We write you this mail because we would like to use cryption in Snmp V3. So=
=20
we need OpenSSL to build this
but we've got a little problem building OpenSSL
indeed, during the make install step, an error occure:

created directory `_install/bin'
created directory `_install/lib'
created directory `_install/lib/pkgconfig'
created directory `_install/include'
created directory `_install/include/openssl'
created directory `_install/_install/ssl/misc'
created directory `_install/_install/ssl/certs'
created directory `_install/_install/ssl/private'
installing crypto...
make[1]: Entering directory `/home/stage/dev/openssl-0.9.7f/crypto'
cp: ne peut cr=E9er le fichier r=E9gulier `_install/include/openssl/crypto.=
h':=20
No such file or directory
chmod: ne peut acc=E9der `_install/include/openssl/crypto.h': No such file =
or=20
directory
cp: ne peut cr=E9er le fichier r=E9gulier `_install/include/openssl/tmdiff.=
h':=20
No such file or directory
chmod: ne peut acc=E9der `_install/include/openssl/tmdiff.h': No such file =
or=20
directory
cp: ne peut cr=E9er le fichier r=E9gulier `_install/include/openssl/openssl=
v.h':=20
No such file or directory
chmod: ne peut acc=E9der `_install/include/openssl/opensslv.h': No such fil=
e=20
or directory
cp: ne peut cr=E9er le fichier r=E9gulier=20
`_install/include/openssl/opensslconf.h': No such file or directory
chmod: ne peut acc=E9der `_install/include/openssl/opensslconf.h': No such=
=20
file or directory
cp: ne peut cr=E9er le fichier r=E9gulier `_install/include/openssl/ebcdic.=
h':=20
No such file or directory
chmod: ne peut acc=E9der `_install/include/openssl/ebcdic.h': No such file =
or=20
directory
cp: ne peut cr=E9er le fichier r=E9gulier `_install/include/openssl/symhack=
s.h':=20
No such file or directory
chmod: ne peut acc=E9der `_install/include/openssl/symhacks.h': No such fil=
e=20
or directory
cp: ne peut cr=E9er le fichier r=E9gulier `_install/include/openssl/ossl_ty=
p.h':=20
No such file or directory
chmod: ne peut acc=E9der `_install/include/openssl/ossl_typ.h': No such fil=
e=20
or directory
make[1]: *** [install] Erreur 1
make[1]: Leaving directory `/home/stage/dev/openssl-0.9.7f/crypto'
installing fips...
make[1]: Entering directory `/home/stage/dev/openssl-0.9.7f/fips'
cp: ne peut cr=E9er le fichier r=E9gulier `_install/include/openssl/fips.h'=
: No=20
such file or directory
chmod: ne peut acc=E9der `_install/include/openssl/fips.h': No such file or=
=20
directory
make[1]: *** [install] Erreur 1
make[1]: Leaving directory `/home/stage/dev/openssl-0.9.7f/fips'
installing ssl...
make[1]: Entering directory `/home/stage/dev/openssl-0.9.7f/ssl'
cp: ne peut cr=E9er le fichier r=E9gulier `_install/include/openssl/ssl.h':=
No=20
such file or directory
chmod: ne peut acc=E9der `_install/include/openssl/ssl.h': No such file or=
=20
directory
cp: ne peut cr=E9er le fichier r=E9gulier `_install/include/openssl/ssl2.h'=
: No=20
such file or directory
chmod: ne peut acc=E9der `_install/include/openssl/ssl2.h': No such file or=
=20
directory
cp: ne peut cr=E9er le fichier r=E9gulier `_install/include/openssl/ssl3.h'=
: No=20
such file or directory
chmod: ne peut acc=E9der `_install/include/openssl/ssl3.h': No such file or=
=20
directory
cp: ne peut cr=E9er le fichier r=E9gulier `_install/include/openssl/ssl23.h=
': No=20
such file or directory
chmod: ne peut acc=E9der `_install/include/openssl/ssl23.h': No such file o=
r=20
directory
cp: ne peut cr=E9er le fichier r=E9gulier `_install/include/openssl/tls1.h'=
: No=20
such file or directory
chmod: ne peut acc=E9der `_install/include/openssl/tls1.h': No such file or=
=20
directory
cp: ne peut cr=E9er le fichier r=E9gulier `_install/include/openssl/kssl.h'=
: No=20
such file or directory
chmod: ne peut acc=E9der `_install/include/openssl/kssl.h': No such file or=
=20
directory
make[1]: *** [install] Erreur 1
make[1]: Leaving directory `/home/stage/dev/openssl-0.9.7f/ssl'
installing apps...
make[1]: Entering directory `/home/stage/dev/openssl-0.9.7f/apps'
installing openssl
cp: ne peut cr=E9er le fichier r=E9gulier `_install/bin/openssl.new': No su=
ch=20
file or directory
chmod: ne peut acc=E9der `_install/bin/openssl.new': No such file or direct=
ory
mv: ne peut =E9valuer `_install/bin/openssl.new': No such file or directory
make[1]: *** [install] Erreur 1
make[1]: Leaving directory `/home/stage/dev/openssl-0.9.7f/apps'
installing test...
make[1]: Entering directory `/home/stage/dev/openssl-0.9.7f/test'
make[1]: Rien =E0 faire pour =AB install =BB.
make[1]: Leaving directory `/home/stage/dev/openssl-0.9.7f/test'
installing tools...
make[1]: Entering directory `/home/stage/dev/openssl-0.9.7f/tools'
cp: ne peut cr=E9er le fichier r=E9gulier `_install/bin/c_rehash.new': No s=
uch=20
file or directory
chmod: ne peut acc=E9der `_install/bin/c_rehash.new': No such file or=20
directory
mv: ne peut =E9valuer `_install/bin/c_rehash.new': No such file or director=
y
make[1]: *** [install] Erreur 1
make[1]: Leaving directory `/home/stage/dev/openssl-0.9.7f/tools'
make: *** [install_sw] Erreur 2
[root@stage-pft11 openssl-0.9.7f]#


to get this, we use the following configure command line:
../config --prefix=3D_install compiler:arm-linux-gcc

so if anyone got an idea about it to help us...

with regards

Fabrice & Fr=E9d=E9ric
--
Plateforme Technologique Valence
T=E9l : 04 75 41 88 58

------=_Part_9596_7954937.1119515225582
Content-Type: text/html; charset=ISO-8859-1
Content-Transfer-Encoding: quoted-printable
Content-Disposition: inline

Hi all



We write you this mail because we would like to use cryption in Snmp V3. So=
we need OpenSSL to build this

but we've got a little problem building OpenSSL

indeed, during the make install step, an error occure:


created directory `_install/bin'

created directory `_install/lib'

created directory `_install/lib/pkgconfig'

created directory `_install/include'

created directory `_install/include/openssl'

created directory `_install/_install/ssl/misc'

created directory `_install/_install/ssl/certs'

created directory `_install/_install/ssl/private'

installing crypto...

make[1]: Entering directory `/home/stage/dev/openssl-0.9.7f/crypto'

cp: ne peut cr=E9er le fichier r=E9gulier `_install/include/openssl/crypto.=
h': No such file or directory

chmod: ne peut acc=E9der `_install/include/openssl/crypto.h': No such file =
or directory

cp: ne peut cr=E9er le fichier r=E9gulier `_install/include/openssl/tmdiff.=
h': No such file or directory

chmod: ne peut acc=E9der `_install/include/openssl/tmdiff.h': No such file =
or directory

cp: ne peut cr=E9er le fichier r=E9gulier `_install/include/openssl/openssl=
v.h': No such file or directory

chmod: ne peut acc=E9der `_install/include/openssl/opensslv.h': No such fil=
e or directory

cp: ne peut cr=E9er le fichier r=E9gulier `_install/include/openssl/openssl=
conf.h': No such file or directory

chmod: ne peut acc=E9der `_install/include/openssl/opensslconf.h': No such =
file or directory

cp: ne peut cr=E9er le fichier r=E9gulier `_install/include/openssl/ebcdic.=
h': No such file or directory

chmod: ne peut acc=E9der `_install/include/openssl/ebcdic.h': No such file =
or directory

cp: ne peut cr=E9er le fichier r=E9gulier `_install/include/openssl/symhack=
s.h': No such file or directory

chmod: ne peut acc=E9der `_install/include/openssl/symhacks.h': No such fil=
e or directory

cp: ne peut cr=E9er le fichier r=E9gulier `_install/include/openssl/ossl_ty=
p.h': No such file or directory

chmod: ne peut acc=E9der `_install/include/openssl/ossl_typ.h': No such fil=
e or directory

make[1]: *** [install] Erreur 1

make[1]: Leaving directory `/home/stage/dev/openssl-0.9.7f/crypto'

installing fips...

make[1]: Entering directory `/home/stage/dev/openssl-0.9.7f/fips'

cp: ne peut cr=E9er le fichier r=E9gulier `_install/include/openssl/fips.h'=
: No such file or directory

chmod: ne peut acc=E9der `_install/include/openssl/fips.h': No such file or=
directory

make[1]: *** [install] Erreur 1

make[1]: Leaving directory `/home/stage/dev/openssl-0.9.7f/fips'

installing ssl...

make[1]: Entering directory `/home/stage/dev/openssl-0.9.7f/ssl'

cp: ne peut cr=E9er le fichier r=E9gulier `_install/include/openssl/ssl.h':=
No such file or directory

chmod: ne peut acc=E9der `_install/include/openssl/ssl.h': No such file or =
directory

cp: ne peut cr=E9er le fichier r=E9gulier `_install/include/openssl/ssl2.h'=
: No such file or directory

chmod: ne peut acc=E9der `_install/include/openssl/ssl2.h': No such file or=
directory

cp: ne peut cr=E9er le fichier r=E9gulier `_install/include/openssl/ssl3.h'=
: No such file or directory

chmod: ne peut acc=E9der `_install/include/openssl/ssl3.h': No such file or=
directory

cp: ne peut cr=E9er le fichier r=E9gulier `_install/include/openssl/ssl23.h=
': No such file or directory

chmod: ne peut acc=E9der `_install/include/openssl/ssl23.h': No such file o=
r directory

cp: ne peut cr=E9er le fichier r=E9gulier `_install/include/openssl/tls1.h'=
: No such file or directory

chmod: ne peut acc=E9der `_install/include/openssl/tls1.h': No such file or=
directory

cp: ne peut cr=E9er le fichier r=E9gulier `_install/include/openssl/kssl.h'=
: No such file or directory

chmod: ne peut acc=E9der `_install/include/openssl/kssl.h': No such file or=
directory

make[1]: *** [install] Erreur 1

make[1]: Leaving directory `/home/stage/dev/openssl-0.9.7f/ssl'

installing apps...

make[1]: Entering directory `/home/stage/dev/openssl-0.9.7f/apps'

installing openssl

cp: ne peut cr=E9er le fichier r=E9gulier `_install/bin/openssl.new': No su=
ch file or directory

chmod: ne peut acc=E9der `_install/bin/openssl.new': No such file or direct=
ory

mv: ne peut =E9valuer `_install/bin/openssl.new': No such file or directory=


make[1]: *** [install] Erreur 1

make[1]: Leaving directory `/home/stage/dev/openssl-0.9.7f/apps'

installing test...

make[1]: Entering directory `/home/stage/dev/openssl-0.9.7f/test'

make[1]: Rien =E0 faire pour =AB install =BB.

make[1]: Leaving directory `/home/stage/dev/openssl-0.9.7f/test'

installing tools...

make[1]: Entering directory `/home/stage/dev/openssl-0.9.7f/tools'

cp: ne peut cr=E9er le fichier r=E9gulier `_install/bin/c_rehash.new': No s=
uch file or directory

chmod: ne peut acc=E9der `_install/bin/c_rehash.new': No such file or direc=
tory

mv: ne peut =E9valuer `_install/bin/c_rehash.new': No such file or director=
y

make[1]: *** [install] Erreur 1

make[1]: Leaving directory `/home/stage/dev/openssl-0.9.7f/tools'

make: *** [install_sw] Erreur 2

[root@stage-pft11 openssl-0.9.7f]#





to get this, we use the following configure command line:

../config --prefix=3D_install compiler:arm-linux-gcc



so if anyone got an idea about it to help us...



with regards


Fabrice & Fr=E9d=E9ric
--
Plateforme Technologique Valence
>T=E9l : 04 75 41 88 58

------=_Part_9596_7954937.1119515225582--
__________________________________________________ ____________________
OpenSSL Project http://www.openssl.org
Development Mailing List openssl-dev@openssl.org
Automated List Manager majordomo@openssl.org