Until recently I could compile external modules with little
trouble. In kernel 2.6.16 I had to modify the module_parm so that's no
this problem. This problem is that I don't know how to include the
build directory's include/linux directory. Here's the exact error
message:

$ make
make -C /lib/modules/2.6.18-1.2798a_FC6/build SUBDIRS=/home/njc/stuff/linux-labjack/driver/linux-2.6 modules
make[1]: Entering directory `/usr/src/redhat/BUILD/kernel-2.6.181.2798a_FC6'
CC [M] /home/njc/stuff/linux-labjack/driver/linux-2.6/labjack.o
/home/njc/stuff/linux-labjack/driver/linux-2.6/labjack.c:43:26: error: linux/config.h: No such file or directory
make[2]: *** [/home/njc/stuff/linux-labjack/driver/linux-2.6/labjack.o] Error 1
make[1]: *** [_module_/home/njc/stuff/linux-labjack/driver/linux-2.6] Error 2
make[1]: Leaving directory `/usr/src/redhat/BUILD/kernel-2.6.181.2798a_FC6'
make: *** [default] Error 2


Any idea's?

--
Linux Home Automation Neil Cherry ncherry@linuxha.com
http://www.linuxha.com/ Main site
http://linuxha.blogspot.com/ My HA Blog
http://home.comcast.net/~ncherry/ Backup site