--Boundary-00=_8dM8DFzYIFtZqvH
Content-Type: text/plain;
charset="iso-8859-15"
Content-Transfer-Encoding: 7bit
Content-Disposition: inline

On Monday 13 February 2006 18:23, Thiago Macieira wrote:
> Ferdinand Gassauer wrote:
> >> But as you say, a config.log is required.

> >
> >here it comes

>
> config.log, not configure's output.

sorry - here is the config.log
--
cu
ferdinand

--Boundary-00=_8dM8DFzYIFtZqvH
Content-Type: text/x-log;
charset="iso-8859-15";
name="config.log"
Content-Transfer-Encoding: 7bit
Content-Disposition: attachment;
filename="config.log"

This file contains any messages produced by compilers while
running configure, to aid debugging if configure makes a mistake.

It was created by configure, which was
generated by GNU Autoconf 2.59. Invocation command line was

$ /daten/kdesvn/kde35src/arts/configure --enable-debug CXXFLAGS=-pipe -march=athlon-xp -m3dnow --prefix=/daten/kdesvn/kde35

## --------- ##
## Platform. ##
## --------- ##

hostname = linuxfg06
uname -m = x86_64
uname -r = 2.6.13-15.8-default
uname -s = Linux
uname -v = #1 Tue Feb 7 11:07:24 UTC 2006

/usr/bin/uname -p = unknown
/bin/uname -X = unknown

/bin/arch = x86_64
/usr/bin/arch -k = unknown
/usr/convex/getsysinfo = unknown
hostinfo = unknown
/bin/machine = unknown
/usr/bin/oslevel = unknown
/bin/universe = unknown

PATH: /daten/kdesvn/kde35src/kdenonbeta/unsermake
PATH: /daten/kdesvn/kde35build/qt-copy/bin
PATH: /daten/kdesvn/kde35/bin
PATH: /bin
PATH: /usr/bin
PATH: /usr/local/bin
PATH: /usr/X11R6/bin


## ----------- ##
## Core tests. ##
## ----------- ##

configure:1615: checking build system type
configure:1633: result: x86_64-unknown-linux-gnu
configure:1641: checking host system type
configure:1655: result: x86_64-unknown-linux-gnu
configure:1663: checking target system type
configure:1677: result: x86_64-unknown-linux-gnu
configure:1729: checking for a BSD-compatible install
configure:1784: result: /usr/bin/install -c
configure:1799: checking for -p flag to install
configure:1812: result: yes
configure:1823: checking whether build environment is sane
configure:1866: result: yes
configure:1918: checking for gawk
configure:1934: found /bin/gawk
configure:1944: result: gawk
configure:1954: checking whether make sets $(MAKE)
configure:1974: result: yes
configure:2155: checking for a BSD-compatible install
configure:2210: result: /usr/bin/install -c -p
configure:2236: checking for style of include used by make
configure:2264: result: GNU
configure:2412: checking for gcc
configure:2428: found /usr/bin/gcc
configure:2438: result: gcc
configure:2682: checking for C compiler version
configure:2685: gcc --version &5
gcc (GCC) 4.0.2 20050901 (prerelease) (SUSE Linux)
Copyright (C) 2005 Free Software Foundation, Inc.
This is free software; see the source for copying conditions. There is NO
warranty; not even for MERCHANTABILITY or FITNESS FOR A PARTICULAR PURPOSE.

configure:2688: $? = 0
configure:2690: gcc -v &5
Using built-in specs.
Target: x86_64-suse-linux
Configured with: ../configure --enable-threads=posix --prefix=/usr --with-local-prefix=/usr/local --infodir=/usr/share/info --mandir=/usr/share/man --libdir=/usr/lib64 --libexecdir=/usr/lib64 --enable-languages=c,c++,objc,f95,java,ada --disable-checking --with-gxx-include-dir=/usr/include/c++/4.0.2 --enable-java-awt=gtk --disable-libjava-multilib --with-slibdir=/lib64 --with-system-zlib --enable-shared --enable-__cxa_atexit --without-system-libunwind --host=x86_64-suse-linux
Thread model: posix
gcc version 4.0.2 20050901 (prerelease) (SUSE Linux)
configure:2693: $? = 0
configure:2695: gcc -V &5
gcc: '-V' option must have argument
configure:2698: $? = 1
configure:2721: checking for C compiler default output file name
configure:2724: gcc conftest.c >&5
configure:2727: $? = 0
configure:2773: result: a.out
configure:2778: checking whether the C compiler works
configure:2784: ./a.out
configure:2787: $? = 0
configure:2804: result: yes
configure:2811: checking whether we are cross compiling
configure:2813: result: no
configure:2816: checking for suffix of executables
configure:2818: gcc -o conftest conftest.c >&5
configure:2821: $? = 0
configure:2846: result:
configure:2852: checking for suffix of object files
configure:2873: gcc -c conftest.c >&5
configure:2876: $? = 0
configure:2898: result: o
configure:2902: checking whether we are using the GNU C compiler
configure:2926: gcc -c conftest.c >&5
configure:2932: $? = 0
configure:2936: test -z
|| test ! -s conftest.err
configure:2939: $? = 0
configure:2942: test -s conftest.o
configure:2945: $? = 0
configure:2958: result: yes
configure:2964: checking whether gcc accepts -g
configure:2985: gcc -c -g conftest.c >&5
configure:2991: $? = 0
configure:2995: test -z
|| test ! -s conftest.err
configure:2998: $? = 0
configure:3001: test -s conftest.o
configure:3004: $? = 0
configure:3015: result: yes
configure:3032: checking for gcc option to accept ANSI C
configure:3102: gcc -c conftest.c >&5
configure:3108: $? = 0
configure:3112: test -z
|| test ! -s conftest.err
configure:3115: $? = 0
configure:3118: test -s conftest.o
configure:3121: $? = 0
configure:3139: result: none needed
configure:3157: gcc -c conftest.c >&5
conftest.c:2: error: syntax error before 'me'
configure:3163: $? = 1
configure: failed program was:
| #ifndef __cplusplus
| choke me
| #endif
configure:3298: checking dependency style of gcc
configure:3388: result: gcc3
configure:3411: checking how to run the C preprocessor
configure:3446: gcc -E conftest.c
configure:3452: $? = 0
configure:3484: gcc -E conftest.c
conftest.c:11:28: error: ac_nonexistent.h: No such file or directory
configure:3490: $? = 1
configure: failed program was:
| /* confdefs.h. */
|
| #define PACKAGE_NAME ""
| #define PACKAGE_TARNAME ""
| #define PACKAGE_VERSION ""
| #define PACKAGE_STRING ""
| #define PACKAGE_BUGREPORT ""
| #define PACKAGE "arts"
| #define VERSION "1.5.1"
| /* end confdefs.h. */
| #include
configure:3529: result: gcc -E
configure:3553: gcc -E conftest.c
configure:3559: $? = 0
configure:3591: gcc -E conftest.c
conftest.c:11:28: error: ac_nonexistent.h: No such file or directory
configure:3597: $? = 1
configure: failed program was:
| /* confdefs.h. */
|
| #define PACKAGE_NAME ""
| #define PACKAGE_TARNAME ""
| #define PACKAGE_VERSION ""
| #define PACKAGE_STRING ""
| #define PACKAGE_BUGREPORT ""
| #define PACKAGE "arts"
| #define VERSION "1.5.1"
| /* end confdefs.h. */
| #include
configure:3721: checking for g++
configure:3737: found /usr/bin/g++
configure:3747: result: g++
configure:3763: checking for C++ compiler version
configure:3766: g++ --version &5
g++ (GCC) 4.0.2 20050901 (prerelease) (SUSE Linux)
Copyright (C) 2005 Free Software Foundation, Inc.
This is free software; see the source for copying conditions. There is NO
warranty; not even for MERCHANTABILITY or FITNESS FOR A PARTICULAR PURPOSE.

configure:3769: $? = 0
configure:3771: g++ -v &5
Using built-in specs.
Target: x86_64-suse-linux
Configured with: ../configure --enable-threads=posix --prefix=/usr --with-local-prefix=/usr/local --infodir=/usr/share/info --mandir=/usr/share/man --libdir=/usr/lib64 --libexecdir=/usr/lib64 --enable-languages=c,c++,objc,f95,java,ada --disable-checking --with-gxx-include-dir=/usr/include/c++/4.0.2 --enable-java-awt=gtk --disable-libjava-multilib --with-slibdir=/lib64 --with-system-zlib --enable-shared --enable-__cxa_atexit --without-system-libunwind --host=x86_64-suse-linux
Thread model: posix
gcc version 4.0.2 20050901 (prerelease) (SUSE Linux)
configure:3774: $? = 0
configure:3776: g++ -V &5
g++: '-V' option must have argument
configure:3779: $? = 1
configure:3782: checking whether we are using the GNU C++ compiler
configure:3806: g++ -c -pipe -march=athlon-xp -m3dnow conftest.cc >&5
conftest.cc:1: error: CPU you selected does not support x86-64 instruction set
conftest.cc:1: error: CPU you selected does not support x86-64 instruction set
configure:3812: $? = 1
configure: failed program was:
| /* confdefs.h. */
|
| #define PACKAGE_NAME ""
| #define PACKAGE_TARNAME ""
| #define PACKAGE_VERSION ""
| #define PACKAGE_STRING ""
| #define PACKAGE_BUGREPORT ""
| #define PACKAGE "arts"
| #define VERSION "1.5.1"
| /* end confdefs.h. */
|
| int
| main ()
| {
| #ifndef __GNUC__
| choke me
| #endif
|
| ;
| return 0;
| }
configure:3838: result: no
configure:3844: checking whether g++ accepts -g
configure:3865: g++ -c -g conftest.cc >&5
configure:3871: $? = 0
configure:3875: test -z
|| test ! -s conftest.err
configure:3878: $? = 0
configure:3881: test -s conftest.o
configure:3884: $? = 0
configure:3895: result: yes
configure:3937: g++ -c -pipe -march=athlon-xp -m3dnow conftest.cc >&5
conftest.cc:1: error: CPU you selected does not support x86-64 instruction set
conftest.cc:1: error: CPU you selected does not support x86-64 instruction set
configure:3943: $? = 1
configure: failed program was:
| /* confdefs.h. */
|
| #define PACKAGE_NAME ""
| #define PACKAGE_TARNAME ""
| #define PACKAGE_VERSION ""
| #define PACKAGE_STRING ""
| #define PACKAGE_BUGREPORT ""
| #define PACKAGE "arts"
| #define VERSION "1.5.1"
| /* end confdefs.h. */
|
| #include
| int
| main ()
| {
| exit (42);
| ;
| return 0;
| }
configure:3937: g++ -c -pipe -march=athlon-xp -m3dnow conftest.cc >&5
conftest.cc:1: error: CPU you selected does not support x86-64 instruction set
conftest.cc:1: error: CPU you selected does not support x86-64 instruction set
configure:3943: $? = 1
configure: failed program was:
| /* confdefs.h. */
|
| #define PACKAGE_NAME ""
| #define PACKAGE_TARNAME ""
| #define PACKAGE_VERSION ""
| #define PACKAGE_STRING ""
| #define PACKAGE_BUGREPORT ""
| #define PACKAGE "arts"
| #define VERSION "1.5.1"
| /* end confdefs.h. */
| extern "C" void std::exit (int) throw (); using std::exit;
| #include
| int
| main ()
| {
| exit (42);
| ;
| return 0;
| }
configure:3937: g++ -c -pipe -march=athlon-xp -m3dnow conftest.cc >&5
conftest.cc:1: error: CPU you selected does not support x86-64 instruction set
conftest.cc:1: error: CPU you selected does not support x86-64 instruction set
configure:3943: $? = 1
configure: failed program was:
| /* confdefs.h. */
|
| #define PACKAGE_NAME ""
| #define PACKAGE_TARNAME ""
| #define PACKAGE_VERSION ""
| #define PACKAGE_STRING ""
| #define PACKAGE_BUGREPORT ""
| #define PACKAGE "arts"
| #define VERSION "1.5.1"
| /* end confdefs.h. */
| extern "C" void std::exit (int); using std::exit;
| #include
| int
| main ()
| {
| exit (42);
| ;
| return 0;
| }
configure:3937: g++ -c -pipe -march=athlon-xp -m3dnow conftest.cc >&5
conftest.cc:1: error: CPU you selected does not support x86-64 instruction set
conftest.cc:1: error: CPU you selected does not support x86-64 instruction set
configure:3943: $? = 1
configure: failed program was:
| /* confdefs.h. */
|
| #define PACKAGE_NAME ""
| #define PACKAGE_TARNAME ""
| #define PACKAGE_VERSION ""
| #define PACKAGE_STRING ""
| #define PACKAGE_BUGREPORT ""
| #define PACKAGE "arts"
| #define VERSION "1.5.1"
| /* end confdefs.h. */
| extern "C" void exit (int) throw ();
| #include
| int
| main ()
| {
| exit (42);
| ;
| return 0;
| }
configure:3937: g++ -c -pipe -march=athlon-xp -m3dnow conftest.cc >&5
conftest.cc:1: error: CPU you selected does not support x86-64 instruction set
conftest.cc:1: error: CPU you selected does not support x86-64 instruction set
configure:3943: $? = 1
configure: failed program was:
| /* confdefs.h. */
|
| #define PACKAGE_NAME ""
| #define PACKAGE_TARNAME ""
| #define PACKAGE_VERSION ""
| #define PACKAGE_STRING ""
| #define PACKAGE_BUGREPORT ""
| #define PACKAGE "arts"
| #define VERSION "1.5.1"
| /* end confdefs.h. */
| extern "C" void exit (int);
| #include
| int
| main ()
| {
| exit (42);
| ;
| return 0;
| }
configure:3937: g++ -c -pipe -march=athlon-xp -m3dnow conftest.cc >&5
conftest.cc:1: error: CPU you selected does not support x86-64 instruction set
conftest.cc:1: error: CPU you selected does not support x86-64 instruction set
configure:3943: $? = 1
configure: failed program was:
| /* confdefs.h. */
|
| #define PACKAGE_NAME ""
| #define PACKAGE_TARNAME ""
| #define PACKAGE_VERSION ""
| #define PACKAGE_STRING ""
| #define PACKAGE_BUGREPORT ""
| #define PACKAGE "arts"
| #define VERSION "1.5.1"
| /* end confdefs.h. */
| void exit (int);
| #include
| int
| main ()
| {
| exit (42);
| ;
| return 0;
| }
configure:4026: checking dependency style of g++
configure:4116: result: gcc3
configure:4135: checking whether gcc is blacklisted
configure:4161: gcc -c -g -O2 -fno-schedule-insns -fno-inline conftest.c >&5
configure:4167: $? = 0
configure:4171: test -z
|| test ! -s conftest.err
configure:4174: $? = 0
configure:4177: test -s conftest.o
configure:4180: $? = 0
configure:4192: result: no
configure:4529: checking whether g++ supports -Wmissing-format-attribute
configure:4565: rm -rf SunWS_cache; g++ -o conftest -ansi -D_XOPEN_SOURCE=500 -D_BSD_SOURCE -Wcast-align -Wconversion -Wchar-subscripts -Wall -W -Wpointer-arith -pipe -march=athlon-xp -m3dnow -Wmissing-format-attribute conftest.cc 1>&5
conftest.cc:1: error: CPU you selected does not support x86-64 instruction set
conftest.cc:1: error: CPU you selected does not support x86-64 instruction set
configure:4571: $? = 1
configure: failed program was:
| /* confdefs.h. */
|
| #define PACKAGE_NAME ""
| #define PACKAGE_TARNAME ""
| #define PACKAGE_VERSION ""
| #define PACKAGE_STRING ""
| #define PACKAGE_BUGREPORT ""
| #define PACKAGE "arts"
| #define VERSION "1.5.1"
| #ifdef __cplusplus
| void exit (int);
| #endif
| /* end confdefs.h. */
|
| int
| main ()
| {
| return 0;
| ;
| return 0;
| }
configure:4610: result: no
configure:4617: checking whether gcc supports -Wmissing-format-attribute
configure:4650: gcc -o conftest -std=iso9899:1990 -W -Wall -Wchar-subscripts -Wshadow -Wpointer-arith -Wmissing-prototypes -Wwrite-strings -D_XOPEN_SOURCE=500 -D_BSD_SOURCE -g -O2 -fno-schedule-insns -fno-inline -Wmissing-format-attribute conftest.c >&5
configure:4656: $? = 0
configure:4660: test -z
|| test ! -s conftest.err
configure:4663: $? = 0
configure:4666: test -s conftest
configure:4669: $? = 0
configure:4690: result: yes
configure:4704: checking whether g++ supports -Wundef
configure:4740: rm -rf SunWS_cache; g++ -o conftest -ansi -D_XOPEN_SOURCE=500 -D_BSD_SOURCE -Wcast-align -Wconversion -Wchar-subscripts -Wall -W -Wpointer-arith -pipe -march=athlon-xp -m3dnow -Wundef conftest.cc 1>&5
conftest.cc:1: error: CPU you selected does not support x86-64 instruction set
conftest.cc:1: error: CPU you selected does not support x86-64 instruction set
configure:4746: $? = 1
configure: failed program was:
| /* confdefs.h. */
|
| #define PACKAGE_NAME ""
| #define PACKAGE_TARNAME ""
| #define PACKAGE_VERSION ""
| #define PACKAGE_STRING ""
| #define PACKAGE_BUGREPORT ""
| #define PACKAGE "arts"
| #define VERSION "1.5.1"
| #ifdef __cplusplus
| void exit (int);
| #endif
| /* end confdefs.h. */
|
| int
| main ()
| {
| return 0;
| ;
| return 0;
| }
configure:4785: result: no
configure:4792: checking whether g++ supports -Wno-long-long
configure:4828: rm -rf SunWS_cache; g++ -o conftest -ansi -D_XOPEN_SOURCE=500 -D_BSD_SOURCE -Wcast-align -Wconversion -Wchar-subscripts -Wall -W -Wpointer-arith -pipe -march=athlon-xp -m3dnow -Wno-long-long conftest.cc 1>&5
conftest.cc:1: error: CPU you selected does not support x86-64 instruction set
conftest.cc:1: error: CPU you selected does not support x86-64 instruction set
configure:4834: $? = 1
configure: failed program was:
| /* confdefs.h. */
|
| #define PACKAGE_NAME ""
| #define PACKAGE_TARNAME ""
| #define PACKAGE_VERSION ""
| #define PACKAGE_STRING ""
| #define PACKAGE_BUGREPORT ""
| #define PACKAGE "arts"
| #define VERSION "1.5.1"
| #ifdef __cplusplus
| void exit (int);
| #endif
| /* end confdefs.h. */
|
| int
| main ()
| {
| return 0;
| ;
| return 0;
| }
configure:4873: result: no
configure:4880: checking whether g++ supports -Wno-non-virtual-dtor
configure:4916: rm -rf SunWS_cache; g++ -o conftest -ansi -D_XOPEN_SOURCE=500 -D_BSD_SOURCE -Wcast-align -Wconversion -Wchar-subscripts -Wall -W -Wpointer-arith -pipe -march=athlon-xp -m3dnow -Wno-non-virtual-dtor conftest.cc 1>&5
conftest.cc:1: error: CPU you selected does not support x86-64 instruction set
conftest.cc:1: error: CPU you selected does not support x86-64 instruction set
configure:4922: $? = 1
configure: failed program was:
| /* confdefs.h. */
|
| #define PACKAGE_NAME ""
| #define PACKAGE_TARNAME ""
| #define PACKAGE_VERSION ""
| #define PACKAGE_STRING ""
| #define PACKAGE_BUGREPORT ""
| #define PACKAGE "arts"
| #define VERSION "1.5.1"
| #ifdef __cplusplus
| void exit (int);
| #endif
| /* end confdefs.h. */
|
| int
| main ()
| {
| return 0;
| ;
| return 0;
| }
configure:4961: result: no
configure:6113: checking how to run the C++ preprocessor
configure:6144: g++ -E conftest.cc
configure:6150: $? = 0
configure:6182: g++ -E conftest.cc
conftest.cc:14:28: error: ac_nonexistent.h: No such file or directory
configure:6188: $? = 1
configure: failed program was:
| /* confdefs.h. */
|
| #define PACKAGE_NAME ""
| #define PACKAGE_TARNAME ""
| #define PACKAGE_VERSION ""
| #define PACKAGE_STRING ""
| #define PACKAGE_BUGREPORT ""
| #define PACKAGE "arts"
| #define VERSION "1.5.1"
| #ifdef __cplusplus
| void exit (int);
| #endif
| /* end confdefs.h. */
| #include
configure:6227: result: g++ -E
configure:6251: g++ -E conftest.cc
configure:6257: $? = 0
configure:6289: g++ -E conftest.cc
conftest.cc:14:28: error: ac_nonexistent.h: No such file or directory
configure:6295: $? = 1
configure: failed program was:
| /* confdefs.h. */
|
| #define PACKAGE_NAME ""
| #define PACKAGE_TARNAME ""
| #define PACKAGE_VERSION ""
| #define PACKAGE_STRING ""
| #define PACKAGE_BUGREPORT ""
| #define PACKAGE "arts"
| #define VERSION "1.5.1"
| #ifdef __cplusplus
| void exit (int);
| #endif
| /* end confdefs.h. */
| #include
configure:6343: checking whether g++ supports -O0
configure:6379: rm -rf SunWS_cache; g++ -o conftest -ansi -D_XOPEN_SOURCE=500 -D_BSD_SOURCE -Wcast-align -Wconversion -Wchar-subscripts -Wall -W -Wpointer-arith -pipe -march=athlon-xp -m3dnow -O0 conftest.cc 1>&5
conftest.cc:1: error: CPU you selected does not support x86-64 instruction set
conftest.cc:1: error: CPU you selected does not support x86-64 instruction set
configure:6385: $? = 1
configure: failed program was:
| /* confdefs.h. */
|
| #define PACKAGE_NAME ""
| #define PACKAGE_TARNAME ""
| #define PACKAGE_VERSION ""
| #define PACKAGE_STRING ""
| #define PACKAGE_BUGREPORT ""
| #define PACKAGE "arts"
| #define VERSION "1.5.1"
| #ifdef __cplusplus
| void exit (int);
| #endif
| /* end confdefs.h. */
|
| int
| main ()
| {
| return 0;
| ;
| return 0;
| }
configure:6424: result: no
configure:6690: checking whether g++ supports -Wl,--no-undefined
configure:6726: rm -rf SunWS_cache; g++ -o conftest -ansi -D_XOPEN_SOURCE=500 -D_BSD_SOURCE -Wcast-align -Wconversion -Wchar-subscripts -Wall -W -Wpointer-arith -pipe -march=athlon-xp -m3dnow -Wl,--no-undefined conftest.cc 1>&5
conftest.cc:1: error: CPU you selected does not support x86-64 instruction set
conftest.cc:1: error: CPU you selected does not support x86-64 instruction set
configure:6732: $? = 1
configure: failed program was:
| /* confdefs.h. */
|
| #define PACKAGE_NAME ""
| #define PACKAGE_TARNAME ""
| #define PACKAGE_VERSION ""
| #define PACKAGE_STRING ""
| #define PACKAGE_BUGREPORT ""
| #define PACKAGE "arts"
| #define VERSION "1.5.1"
| #ifdef __cplusplus
| void exit (int);
| #endif
| /* end confdefs.h. */
|
| int
| main ()
| {
| return 0;
| ;
| return 0;
| }
configure:6858: result: no
configure:7000: result: using lib directory suffix 64
configure:7028: checking for a sed that does not truncate output
configure:7082: result: /bin/sed
configure:7085: checking for egrep
configure:7095: result: grep -E
configure:7111: checking for ld used by gcc
configure:7178: result: /usr/x86_64-suse-linux/bin/ld
configure:7187: checking if the linker (/usr/x86_64-suse-linux/bin/ld) is GNU ld
configure:7202: result: yes
configure:7207: checking for /usr/x86_64-suse-linux/bin/ld option to reload object files
configure:7214: result: -r
configure:7223: checking for BSD-compatible nm
configure:7265: result: /usr/bin/nm -B
configure:7269: checking whether ln -s works
configure:7273: result: yes
configure:7280: checking how to recognise dependent libraries
configure:7487: result: pass_all
configure:7569: gcc -c -std=iso9899:1990 -W -Wall -Wchar-subscripts -Wshadow -Wpointer-arith -Wmissing-prototypes -Wwrite-strings -D_XOPEN_SOURCE=500 -D_BSD_SOURCE -g -O2 -fno-schedule-insns -fno-inline -Wformat-security -Wmissing-format-attribute conftest.c >&5
configure:7572: $? = 0
configure:7696: checking for ANSI C header files
configure:7721: gcc -c -std=iso9899:1990 -W -Wall -Wchar-subscripts -Wshadow -Wpointer-arith -Wmissing-prototypes -Wwrite-strings -D_XOPEN_SOURCE=500 -D_BSD_SOURCE -g -O2 -fno-schedule-insns -fno-inline -Wformat-security -Wmissing-format-attribute conftest.c >&5
configure:7727: $? = 0
configure:7731: test -z
|| test ! -s conftest.err
configure:7734: $? = 0
configure:7737: test -s conftest.o
configure:7740: $? = 0
configure:7829: gcc -o conftest -std=iso9899:1990 -W -Wall -Wchar-subscripts -Wshadow -Wpointer-arith -Wmissing-prototypes -Wwrite-strings -D_XOPEN_SOURCE=500 -D_BSD_SOURCE -g -O2 -fno-schedule-insns -fno-inline -Wformat-security -Wmissing-format-attribute conftest.c >&5
conftest.c: In function 'main':
conftest.c:32: warning: implicit declaration of function 'exit'
conftest.c:32: warning: incompatible implicit declaration of built-in function 'exit'
configure:7832: $? = 0
configure:7834: ./conftest
configure:7837: $? = 0
configure:7852: result: yes
configure:7876: checking for sys/types.h
configure:7892: gcc -c -std=iso9899:1990 -W -Wall -Wchar-subscripts -Wshadow -Wpointer-arith -Wmissing-prototypes -Wwrite-strings -D_XOPEN_SOURCE=500 -D_BSD_SOURCE -g -O2 -fno-schedule-insns -fno-inline -Wformat-security -Wmissing-format-attribute conftest.c >&5
configure:7898: $? = 0
configure:7902: test -z
|| test ! -s conftest.err
configure:7905: $? = 0
configure:7908: test -s conftest.o
configure:7911: $? = 0
configure:7922: result: yes
configure:7876: checking for sys/stat.h
configure:7892: gcc -c -std=iso9899:1990 -W -Wall -Wchar-subscripts -Wshadow -Wpointer-arith -Wmissing-prototypes -Wwrite-strings -D_XOPEN_SOURCE=500 -D_BSD_SOURCE -g -O2 -fno-schedule-insns -fno-inline -Wformat-security -Wmissing-format-attribute conftest.c >&5
configure:7898: $? = 0
configure:7902: test -z
|| test ! -s conftest.err
configure:7905: $? = 0
configure:7908: test -s conftest.o
configure:7911: $? = 0
configure:7922: result: yes
configure:7876: checking for stdlib.h
configure:7892: gcc -c -std=iso9899:1990 -W -Wall -Wchar-subscripts -Wshadow -Wpointer-arith -Wmissing-prototypes -Wwrite-strings -D_XOPEN_SOURCE=500 -D_BSD_SOURCE -g -O2 -fno-schedule-insns -fno-inline -Wformat-security -Wmissing-format-attribute conftest.c >&5
configure:7898: $? = 0
configure:7902: test -z
|| test ! -s conftest.err
configure:7905: $? = 0
configure:7908: test -s conftest.o
configure:7911: $? = 0
configure:7922: result: yes
configure:7876: checking for string.h
configure:7892: gcc -c -std=iso9899:1990 -W -Wall -Wchar-subscripts -Wshadow -Wpointer-arith -Wmissing-prototypes -Wwrite-strings -D_XOPEN_SOURCE=500 -D_BSD_SOURCE -g -O2 -fno-schedule-insns -fno-inline -Wformat-security -Wmissing-format-attribute conftest.c >&5
configure:7898: $? = 0
configure:7902: test -z
|| test ! -s conftest.err
configure:7905: $? = 0
configure:7908: test -s conftest.o
configure:7911: $? = 0
configure:7922: result: yes
configure:7876: checking for memory.h
configure:7892: gcc -c -std=iso9899:1990 -W -Wall -Wchar-subscripts -Wshadow -Wpointer-arith -Wmissing-prototypes -Wwrite-strings -D_XOPEN_SOURCE=500 -D_BSD_SOURCE -g -O2 -fno-schedule-insns -fno-inline -Wformat-security -Wmissing-format-attribute conftest.c >&5
configure:7898: $? = 0
configure:7902: test -z
|| test ! -s conftest.err
configure:7905: $? = 0
configure:7908: test -s conftest.o
configure:7911: $? = 0
configure:7922: result: yes
configure:7876: checking for strings.h
configure:7892: gcc -c -std=iso9899:1990 -W -Wall -Wchar-subscripts -Wshadow -Wpointer-arith -Wmissing-prototypes -Wwrite-strings -D_XOPEN_SOURCE=500 -D_BSD_SOURCE -g -O2 -fno-schedule-insns -fno-inline -Wformat-security -Wmissing-format-attribute conftest.c >&5
configure:7898: $? = 0
configure:7902: test -z
|| test ! -s conftest.err
configure:7905: $? = 0
configure:7908: test -s conftest.o
configure:7911: $? = 0
configure:7922: result: yes
configure:7876: checking for inttypes.h
configure:7892: gcc -c -std=iso9899:1990 -W -Wall -Wchar-subscripts -Wshadow -Wpointer-arith -Wmissing-prototypes -Wwrite-strings -D_XOPEN_SOURCE=500 -D_BSD_SOURCE -g -O2 -fno-schedule-insns -fno-inline -Wformat-security -Wmissing-format-attribute conftest.c >&5
configure:7898: $? = 0
configure:7902: test -z
|| test ! -s conftest.err
configure:7905: $? = 0
configure:7908: test -s conftest.o
configure:7911: $? = 0
configure:7922: result: yes
configure:7876: checking for stdint.h
configure:7892: gcc -c -std=iso9899:1990 -W -Wall -Wchar-subscripts -Wshadow -Wpointer-arith -Wmissing-prototypes -Wwrite-strings -D_XOPEN_SOURCE=500 -D_BSD_SOURCE -g -O2 -fno-schedule-insns -fno-inline -Wformat-security -Wmissing-format-attribute conftest.c >&5
configure:7898: $? = 0
configure:7902: test -z
|| test ! -s conftest.err
configure:7905: $? = 0
configure:7908: test -s conftest.o
configure:7911: $? = 0
configure:7922: result: yes
configure:7876: checking for unistd.h
configure:7892: gcc -c -std=iso9899:1990 -W -Wall -Wchar-subscripts -Wshadow -Wpointer-arith -Wmissing-prototypes -Wwrite-strings -D_XOPEN_SOURCE=500 -D_BSD_SOURCE -g -O2 -fno-schedule-insns -fno-inline -Wformat-security -Wmissing-format-attribute conftest.c >&5
configure:7898: $? = 0
configure:7902: test -z
|| test ! -s conftest.err
configure:7905: $? = 0
configure:7908: test -s conftest.o
configure:7911: $? = 0
configure:7922: result: yes
configure:7948: checking dlfcn.h usability
configure:7960: gcc -c -std=iso9899:1990 -W -Wall -Wchar-subscripts -Wshadow -Wpointer-arith -Wmissing-prototypes -Wwrite-strings -D_XOPEN_SOURCE=500 -D_BSD_SOURCE -g -O2 -fno-schedule-insns -fno-inline -Wformat-security -Wmissing-format-attribute conftest.c >&5
configure:7966: $? = 0
configure:7970: test -z
|| test ! -s conftest.err
configure:7973: $? = 0
configure:7976: test -s conftest.o
configure:7979: $? = 0
configure:7989: result: yes
configure:7993: checking dlfcn.h presence
configure:8003: gcc -E conftest.c
configure:8009: $? = 0
configure:8029: result: yes
configure:8064: checking for dlfcn.h
configure:8071: result: yes
configure:8135: checking for g77
configure:8164: result: no
configure:8135: checking for f77
configure:8164: result: no
configure:8135: checking for xlf
configure:8164: result: no
configure:8135: checking for frt
configure:8164: result: no
configure:8135: checking for pgf77
configure:8164: result: no
configure:8135: checking for fort77
configure:8164: result: no
configure:8135: checking for fl32
configure:8164: result: no
configure:8135: checking for af77
configure:8164: result: no
configure:8135: checking for f90
configure:8164: result: no
configure:8135: checking for xlf90
configure:8164: result: no
configure:8135: checking for pgf90
configure:8164: result: no
configure:8135: checking for epcf90
configure:8164: result: no
configure:8135: checking for f95
configure:8164: result: no
configure:8135: checking for fort
configure:8164: result: no
configure:8135: checking for xlf95
configure:8164: result: no
configure:8135: checking for ifc
configure:8164: result: no
configure:8135: checking for efc
configure:8164: result: no
configure:8135: checking for pgf95
configure:8164: result: no
configure:8135: checking for lf95
configure:8164: result: no
configure:8135: checking for gfortran
configure:8164: result: no
configure:8176: checking for Fortran 77 compiler version
configure:8179: --version &5
/daten/kdesvn/kde35src/arts/configure: line 8180: --version: command not found
configure:8182: $? = 127
configure:8184: -v &5
/daten/kdesvn/kde35src/arts/configure: line 8185: -v: command not found
configure:8187: $? = 127
configure:8189: -V &5
/daten/kdesvn/kde35src/arts/configure: line 8190: -V: command not found
configure:8192: $? = 127
configure:8200: checking whether we are using the GNU Fortran 77 compiler
configure:8214: -c conftest.F >&5
/daten/kdesvn/kde35src/arts/configure: line 8215: -c: command not found
configure:8220: $? = 127
configure: failed program was:
| program main
| #ifndef __GNUC__
| choke me
| #endif
|
| end
configure:8246: result: no
configure:8252: checking whether accepts -g
configure:8264: -c -g conftest.f >&5
/daten/kdesvn/kde35src/arts/configure: line 8265: -c: command not found
configure:8270: $? = 127
configure: failed program was:
| program main
|
| end
configure:8295: result: no
configure:8325: checking the maximum length of command line arguments
configure:8384: result: 32768
configure:8395: checking command to parse /usr/bin/nm -B output from gcc object
configure:8484: gcc -c -std=iso9899:1990 -W -Wall -Wchar-subscripts -Wshadow -Wpointer-arith -Wmissing-prototypes -Wwrite-strings -D_XOPEN_SOURCE=500 -D_BSD_SOURCE -g -O2 -fno-schedule-insns -fno-inline -Wformat-security -Wmissing-format-attribute conftest.c >&5
conftest.c:5: warning: no previous prototype for 'nm_test_func'
configure:8487: $? = 0
configure:8491: /usr/bin/nm -B conftest.o \| sed -n -e 's/^.*[ ]\([ABCDGISTW][ABCDGISTW]*\)[ ][ ]*\(\)\([_A-Za-z][_A-Za-z0-9]*\)$/\1 \2\3 \3/p' \> conftest.nm
configure:8494: $? = 0
configure:8546: gcc -o conftest -std=iso9899:1990 -W -Wall -Wchar-subscripts -Wshadow -Wpointer-arith -Wmissing-prototypes -Wwrite-strings -D_XOPEN_SOURCE=500 -D_BSD_SOURCE -g -O2 -fno-schedule-insns -fno-inline -Wformat-security -Wmissing-format-attribute conftest.c conftstm.o >&5
configure:8549: $? = 0
configure:8587: result: ok
configure:8591: checking for objdir
configure:8606: result: .libs
configure:8696: checking for ar
configure:8712: found /usr/bin/ar
configure:8723: result: ar
configure:8776: checking for ranlib
configure:8792: found /usr/bin/ranlib
configure:8803: result: ranlib
configure:8856: checking for strip
configure:8872: found /usr/bin/strip
configure:8883: result: strip
configure:9145: checking if gcc static flag works
configure:9168: result: yes
configure:9190: checking if gcc supports -fno-rtti -fno-exceptions
configure:9208: gcc -c -std=iso9899:1990 -W -Wall -Wchar-subscripts -Wshadow -Wpointer-arith -Wmissing-prototypes -Wwrite-strings -D_XOPEN_SOURCE=500 -D_BSD_SOURCE -g -O2 -fno-schedule-insns -fno-inline -Wformat-security -Wmissing-format-attribute -fno-rtti -fno-exceptions conftest.c >&5
cc1: warning: command line option "-fno-rtti" is valid for C++/ObjC++ but not for C
configure:9212: $? = 0
configure:9223: result: no
configure:9238: checking for gcc option to produce PIC
configure:9415: result: -fPIC
configure:9423: checking if gcc PIC flag -fPIC works
configure:9441: gcc -c -std=iso9899:1990 -W -Wall -Wchar-subscripts -Wshadow -Wpointer-arith -Wmissing-prototypes -Wwrite-strings -D_XOPEN_SOURCE=500 -D_BSD_SOURCE -g -O2 -fno-schedule-insns -fno-inline -Wformat-security -Wmissing-format-attribute -fPIC -DPIC conftest.c >&5
configure:9445: $? = 0
configure:9456: result: yes
configure:9480: checking if gcc supports -c -o file.o
configure:9508: gcc -c -std=iso9899:1990 -W -Wall -Wchar-subscripts -Wshadow -Wpointer-arith -Wmissing-prototypes -Wwrite-strings -D_XOPEN_SOURCE=500 -D_BSD_SOURCE -g -O2 -fno-schedule-insns -fno-inline -Wformat-security -Wmissing-format-attribute -o out/conftest2.o conftest.c >&5
configure:9512: $? = 0
configure:9529: result: yes
configure:9555: checking whether the gcc linker (/usr/x86_64-suse-linux/bin/ld -m elf_x86_64) supports shared libraries
configure:10367: result: yes
configure:10393: checking whether -lc should be explicitly linked in
configure:10398: gcc -c -std=iso9899:1990 -W -Wall -Wchar-subscripts -Wshadow -Wpointer-arith -Wmissing-prototypes -Wwrite-strings -D_XOPEN_SOURCE=500 -D_BSD_SOURCE -g -O2 -fno-schedule-insns -fno-inline -Wformat-security -Wmissing-format-attribute conftest.c >&5
configure:10401: $? = 0
configure:10415: gcc -shared -v conftest.o -Wl,-soname -Wl,conftest -o conftest 2\>\&1 \| grep -lc \>/dev/null 2\>\&1
configure:10418: $? = 0
configure:10430: result: no
configure:10438: checking dynamic linker characteristics
configure:10956: result: GNU/Linux ld.so
configure:10960: checking how to hardcode library paths into programs
configure:10985: result: immediate
configure:10999: checking whether stripping libraries is possible
configure:11004: result: yes
configure:11130: checking for shl_load
configure:11187: gcc -o conftest -std=iso9899:1990 -W -Wall -Wchar-subscripts -Wshadow -Wpointer-arith -Wmissing-prototypes -Wwrite-strings -D_XOPEN_SOURCE=500 -D_BSD_SOURCE -g -O2 -fno-schedule-insns -fno-inline -Wformat-security -Wmissing-format-attribute conftest.c >&5
/tmp/ccLVjZgw.o: In function `main':
/hd/sdb1/daten/kdesvn/kde35build/arts/conftest.c:65: undefined reference to `shl_load'
/tmp/ccLVjZgw.o.data+0x0): undefined reference to `shl_load'
collect2: ld returned 1 exit status
configure:11193: $? = 1
configure: failed program was:
| /* confdefs.h. */
|
| #define PACKAGE_NAME ""
| #define PACKAGE_TARNAME ""
| #define PACKAGE_VERSION ""
| #define PACKAGE_STRING ""
| #define PACKAGE_BUGREPORT ""
| #define PACKAGE "arts"
| #define VERSION "1.5.1"
| #ifdef __cplusplus
| void exit (int);
| #endif
| #define KDELIBSUFF "64"
| #define STDC_HEADERS 1
| #define HAVE_SYS_TYPES_H 1
| #define HAVE_SYS_STAT_H 1
| #define HAVE_STDLIB_H 1
| #define HAVE_STRING_H 1
| #define HAVE_MEMORY_H 1
| #define HAVE_STRINGS_H 1
| #define HAVE_INTTYPES_H 1
| #define HAVE_STDINT_H 1
| #define HAVE_UNISTD_H 1
| #define HAVE_DLFCN_H 1
| /* end confdefs.h. */
| /* Define shl_load to an innocuous variant, in case declares shl_load.
| For example, HP-UX 11i declares gettimeofday. */
| #define shl_load innocuous_shl_load
|
| /* System header to define __stub macros and hopefully few prototypes,
| which can conflict with char shl_load (); below.
| Prefer to if __STDC__ is defined, since
| exists even on freestanding compilers. */
|
| #ifdef __STDC__
| # include
| #else
| # include
| #endif
|
| #undef shl_load
|
| /* Override any gcc2 internal prototype to avoid an error. */
| #ifdef __cplusplus
| extern "C"
| {
| #endif
| /* We use char because int might match the return type of a gcc2
| builtin and then its argument prototype would still apply. */
| char shl_load ();
| /* The GNU C library defines this for functions which it implements
| to always fail with ENOSYS. Some functions are actually named
| something starting with __ and the normal name is an alias. */
| #if defined (__stub_shl_load) || defined (__stub___shl_load)
| choke me
| #else
| char (*f) () = shl_load;
| #endif
| #ifdef __cplusplus
| }
| #endif
|
| int
| main ()
| {
| return f != shl_load;
| ;
| return 0;
| }
configure:11218: result: no
configure:11223: checking for shl_load in -ldld
configure:11253: gcc -o conftest -std=iso9899:1990 -W -Wall -Wchar-subscripts -Wshadow -Wpointer-arith -Wmissing-prototypes -Wwrite-strings -D_XOPEN_SOURCE=500 -D_BSD_SOURCE -g -O2 -fno-schedule-insns -fno-inline -Wformat-security -Wmissing-format-attribute conftest.c -ldld >&5
/usr/lib64/gcc/x86_64-suse-linux/4.0.2/../../../../x86_64-suse-linux/bin/ld: cannot find -ldld
collect2: ld returned 1 exit status
configure:11259: $? = 1
configure: failed program was:
| /* confdefs.h. */
|
| #define PACKAGE_NAME ""
| #define PACKAGE_TARNAME ""
| #define PACKAGE_VERSION ""
| #define PACKAGE_STRING ""
| #define PACKAGE_BUGREPORT ""
| #define PACKAGE "arts"
| #define VERSION "1.5.1"
| #ifdef __cplusplus
| void exit (int);
| #endif
| #define KDELIBSUFF "64"
| #define STDC_HEADERS 1
| #define HAVE_SYS_TYPES_H 1
| #define HAVE_SYS_STAT_H 1
| #define HAVE_STDLIB_H 1
| #define HAVE_STRING_H 1
| #define HAVE_MEMORY_H 1
| #define HAVE_STRINGS_H 1
| #define HAVE_INTTYPES_H 1
| #define HAVE_STDINT_H 1
| #define HAVE_UNISTD_H 1
| #define HAVE_DLFCN_H 1
| /* end confdefs.h. */
|
| /* Override any gcc2 internal prototype to avoid an error. */
| #ifdef __cplusplus
| extern "C"
| #endif
| /* We use char because int might match the return type of a gcc2
| builtin and then its argument prototype would still apply. */
| char shl_load ();
| int
| main ()
| {
| shl_load ();
| ;
| return 0;
| }
configure:11285: result: no
configure:11290: checking for dlopen
configure:11347: gcc -o conftest -std=iso9899:1990 -W -Wall -Wchar-subscripts -Wshadow -Wpointer-arith -Wmissing-prototypes -Wwrite-strings -D_XOPEN_SOURCE=500 -D_BSD_SOURCE -g -O2 -fno-schedule-insns -fno-inline -Wformat-security -Wmissing-format-attribute conftest.c >&5
/tmp/cc891z8R.o: In function `main':
/hd/sdb1/daten/kdesvn/kde35build/arts/conftest.c:65: undefined reference to `dlopen'
/tmp/cc891z8R.o.data+0x0): undefined reference to `dlopen'
collect2: ld returned 1 exit status
configure:11353: $? = 1
configure: failed program was:
| /* confdefs.h. */
|
| #define PACKAGE_NAME ""
| #define PACKAGE_TARNAME ""
| #define PACKAGE_VERSION ""
| #define PACKAGE_STRING ""
| #define PACKAGE_BUGREPORT ""
| #define PACKAGE "arts"
| #define VERSION "1.5.1"
| #ifdef __cplusplus
| void exit (int);
| #endif
| #define KDELIBSUFF "64"
| #define STDC_HEADERS 1
| #define HAVE_SYS_TYPES_H 1
| #define HAVE_SYS_STAT_H 1
| #define HAVE_STDLIB_H 1
| #define HAVE_STRING_H 1
| #define HAVE_MEMORY_H 1
| #define HAVE_STRINGS_H 1
| #define HAVE_INTTYPES_H 1
| #define HAVE_STDINT_H 1
| #define HAVE_UNISTD_H 1
| #define HAVE_DLFCN_H 1
| /* end confdefs.h. */
| /* Define dlopen to an innocuous variant, in case declares dlopen.
| For example, HP-UX 11i declares gettimeofday. */
| #define dlopen innocuous_dlopen
|
| /* System header to define __stub macros and hopefully few prototypes,
| which can conflict with char dlopen (); below.
| Prefer to if __STDC__ is defined, since
| exists even on freestanding compilers. */
|
| #ifdef __STDC__
| # include
| #else
| # include
| #endif
|
| #undef dlopen
|
| /* Override any gcc2 internal prototype to avoid an error. */
| #ifdef __cplusplus
| extern "C"
| {
| #endif
| /* We use char because int might match the return type of a gcc2
| builtin and then its argument prototype would still apply. */
| char dlopen ();
| /* The GNU C library defines this for functions which it implements
| to always fail with ENOSYS. Some functions are actually named
| something starting with __ and the normal name is an alias. */
| #if defined (__stub_dlopen) || defined (__stub___dlopen)
| choke me
| #else
| char (*f) () = dlopen;
| #endif
| #ifdef __cplusplus
| }
| #endif
|
| int
| main ()
| {
| return f != dlopen;
| ;
| return 0;
| }
configure:11378: result: no
configure:11383: checking for dlopen in -ldl
configure:11413: gcc -o conftest -std=iso9899:1990 -W -Wall -Wchar-subscripts -Wshadow -Wpointer-arith -Wmissing-prototypes -Wwrite-strings -D_XOPEN_SOURCE=500 -D_BSD_SOURCE -g -O2 -fno-schedule-insns -fno-inline -Wformat-security -Wmissing-format-attribute conftest.c -ldl >&5
configure:11419: $? = 0
configure:11423: test -z
|| test ! -s conftest.err
configure:11426: $? = 0
configure:11429: test -s conftest
configure:11432: $? = 0
configure:11445: result: yes
configure:11620: checking whether a program can dlopen itself
configure:11692: gcc -o conftest -std=iso9899:1990 -W -Wall -Wchar-subscripts -Wshadow -Wpointer-arith -Wmissing-prototypes -Wwrite-strings -D_XOPEN_SOURCE=500 -D_BSD_SOURCE -g -O2 -fno-schedule-insns -fno-inline -Wformat-security -Wmissing-format-attribute -DHAVE_DLFCN_H -Wl,--export-dynamic conftest.c -ldl >&5
configure:11675: warning: no previous prototype for 'fnord'
configure: In function 'fnord':
configure:11675: warning: unused variable 'i'
configure: In function 'main':
configure:11688: warning: implicit declaration of function 'exit'
configure:11688: warning: incompatible implicit declaration of built-in function 'exit'
configure:11695: $? = 0
configure:11713: result: yes
configure:11718: checking whether a statically linked program can dlopen itself
configure:11790: gcc -o conftest -std=iso9899:1990 -W -Wall -Wchar-subscripts -Wshadow -Wpointer-arith -Wmissing-prototypes -Wwrite-strings -D_XOPEN_SOURCE=500 -D_BSD_SOURCE -g -O2 -fno-schedule-insns -fno-inline -Wformat-security -Wmissing-format-attribute -DHAVE_DLFCN_H -Wl,--export-dynamic conftest.c -ldl >&5
configure:11773: warning: no previous prototype for 'fnord'
configure: In function 'fnord':
configure:11773: warning: unused variable 'i'
configure: In function 'main':
configure:11786: warning: implicit declaration of function 'exit'
configure:11786: warning: incompatible implicit declaration of built-in function 'exit'
configure:11793: $? = 0
configure:11811: result: yes
configure:11834: checking if libtool supports shared libraries
configure:11836: result: yes
configure:11839: checking whether to build shared libraries
configure:11897: result: yes
configure:11900: checking whether to build static libraries
configure:11904: result: no
configure:11995: creating libtool
configure:12681: checking whether the g++ linker (/usr/x86_64-suse-linux/bin/ld -m elf_x86_64) supports shared libraries
configure:13495: result: yes
configure:13517: g++ -c -ansi -D_XOPEN_SOURCE=500 -D_BSD_SOURCE -Wcast-align -Wconversion -Wchar-subscripts -Wall -W -Wpointer-arith -pipe -march=athlon-xp -m3dnow conftest.cc >&5
conftest.cc:1: error: CPU you selected does not support x86-64 instruction set
conftest.cc:1: error: CPU you selected does not support x86-64 instruction set
configure:13520: $? = 1
configure:13616: checking for g++ option to produce PIC
configure:13868: result:
configure:13933: checking if g++ supports -c -o file.o
configure:13961: g++ -c -ansi -D_XOPEN_SOURCE=500 -D_BSD_SOURCE -Wcast-align -Wconversion -Wchar-subscripts -Wall -W -Wpointer-arith -pipe -march=athlon-xp -m3dnow -o out/conftest2.o conftest.cc >&5
conftest.cc:1: error: CPU you selected does not support x86-64 instruction set
conftest.cc:1: error: CPU you selected does not support x86-64 instruction set
configure:13965: $? = 1
configure:13982: result: no
configure:14008: checking whether the g++ linker (/usr/x86_64-suse-linux/bin/ld -m elf_x86_64) supports shared libraries
configure:14033: result: yes
configure:14104: checking dynamic linker characteristics
configure:14622: result: GNU/Linux ld.so
configure:14626: checking how to hardcode library paths into programs
configure:14651: result: immediate
configure:14665: checking whether stripping libraries is possible
configure:14670: result: yes
configure:14796: checking for shl_load
configure:14884: result: no
configure:14889: checking for shl_load in -ldld
configure:14951: result: no
configure:14956: checking for dlopen
configure:15044: result: no
configure:15049: checking for dlopen in -ldl
configure:15111: result: yes
configure:15286: checking whether a program can dlopen itself
configure:15379: result: yes
configure:15384: checking whether a statically linked program can dlopen itself
configure:15477: result: yes
configure:21854: checking which extension is used for shared libraries
configure:21879: result:
configure:21889: checking which variable specifies run-time library path
configure:21896: result: LD_LIBRARY_PATH
configure:21906: checking for the default library search path
configure:21913: result: /lib64 /usr/lib64
configure:21935: checking for objdir
configure:21955: result: .libs
configure:21964: checking command to parse /usr/bin/nm -B output
configure:22028: gcc -c -std=iso9899:1990 -W -Wall -Wchar-subscripts -Wshadow -Wpointer-arith -Wmissing-prototypes -Wwrite-strings -D_XOPEN_SOURCE=500 -D_BSD_SOURCE -g -O2 -fno-schedule-insns -fno-inline -Wformat-security -Wmissing-format-attribute conftest.c >&5
conftest.c:5: warning: no previous prototype for 'nm_test_func'
conftest.c: In function 'main':
conftest.c:9: warning: statement with no effect
configure:22031: $? = 0
configure:22036: /usr/bin/nm -B conftest.o \| sed -n -e 's/^.* \([ABCDGISTW]\) *\(\)\([_A-Za-z][_A-Za-z0-9]*\)$/\1 \2\3 \3/p' \> conftest.nm
configure:22039: $? = 0
configure:22092: gcc -o conftest -std=iso9899:1990 -W -Wall -Wchar-subscripts -Wshadow -Wpointer-arith -Wmissing-prototypes -Wwrite-strings -D_XOPEN_SOURCE=500 -D_BSD_SOURCE -g -O2 -fno-schedule-insns -fno-inline -Wformat-security -Wmissing-format-attribute -fno-builtin conftest.c conftstm.o >&5
conftest.c:6: warning: 'main' is usually a function
configure:22095: $? = 0
configure:22139: result: yes
configure:22142: checking whether libtool supports -dlopen/-dlpreopen
configure:22154: result: yes
configure:22165: checking for dlopen in -ldl
configure:22227: result: yes
configure:22410: checking for shl_load
configure:22498: result: no
configure:22507: checking for shl_load in -ldld
configure:22569: result: no
configure:22583: checking for dld_link in -ldld
configure:22613: gcc -o conftest -std=iso9899:1990 -W -Wall -Wchar-subscripts -Wshadow -Wpointer-arith -Wmissing-prototypes -Wwrite-strings -D_XOPEN_SOURCE=500 -D_BSD_SOURCE -g -O2 -fno-schedule-insns -fno-inline -Wformat-security -Wmissing-format-attribute conftest.c -ldld >&5
/usr/lib64/gcc/x86_64-suse-linux/4.0.2/../../../../x86_64-suse-linux/bin/ld: cannot find -ldld
collect2: ld returned 1 exit status
configure:22619: $? = 1
configure: failed program was:
| /* confdefs.h. */
|
| #define PACKAGE_NAME ""
| #define PACKAGE_TARNAME ""
| #define PACKAGE_VERSION ""
| #define PACKAGE_STRING ""
| #define PACKAGE_BUGREPORT ""
| #define PACKAGE "arts"
| #define VERSION "1.5.1"
| #ifdef __cplusplus
| void exit (int);
| #endif
| #define KDELIBSUFF "64"
| #define STDC_HEADERS 1
| #define HAVE_SYS_TYPES_H 1
| #define HAVE_SYS_STAT_H 1
| #define HAVE_STDLIB_H 1
| #define HAVE_STRING_H 1
| #define HAVE_MEMORY_H 1
| #define HAVE_STRINGS_H 1
| #define HAVE_INTTYPES_H 1
| #define HAVE_STDINT_H 1
| #define HAVE_UNISTD_H 1
| #define HAVE_DLFCN_H 1
| #define LTDL_SHLIBPATH_VAR "LD_LIBRARY_PATH"
| #define LTDL_SYSSEARCHPATH "/lib64:/usr/lib64"
| #define LTDL_OBJDIR ".libs/"
| #define HAVE_PRELOADED_SYMBOLS 1
| #define HAVE_LIBDL 1
| /* end confdefs.h. */
|
| /* Override any gcc2 internal prototype to avoid an error. */
| #ifdef __cplusplus
| extern "C"
| #endif
| /* We use char because int might match the return type of a gcc2
| builtin and then its argument prototype would still apply. */
| char dld_link ();
| int
| main ()
| {
| dld_link ();
| ;
| return 0;
| }
configure:22645: result: no
configure:22664: checking for dlerror
configure:22721: gcc -o conftest -std=iso9899:1990 -W -Wall -Wchar-subscripts -Wshadow -Wpointer-arith -Wmissing-prototypes -Wwrite-strings -D_XOPEN_SOURCE=500 -D_BSD_SOURCE -g -O2 -fno-schedule-insns -fno-inline -Wformat-security -Wmissing-format-attribute conftest.c -ldl >&5
configure:22727: $? = 0
configure:22731: test -z
|| test ! -s conftest.err
configure:22734: $? = 0
configure:22737: test -s conftest
configure:22740: $? = 0
configure:22752: result: yes
configure:22765: checking for _ prefix in compiled symbols
configure:22808: result: no
configure:22917: checking whether deplibs are loaded by dlopen
configure:22949: result: yes
configure:22981: checking malloc.h usability
configure:22993: gcc -c -std=iso9899:1990 -W -Wall -Wchar-subscripts -Wshadow -Wpointer-arith -Wmissing-prototypes -Wwrite-strings -D_XOPEN_SOURCE=500 -D_BSD_SOURCE -g -O2 -fno-schedule-insns -fno-inline -Wformat-security -Wmissing-format-attribute conftest.c >&5
configure:22999: $? = 0
configure:23003: test -z
|| test ! -s conftest.err
configure:23006: $? = 0
configure:23009: test -s conftest.o
configure:23012: $? = 0
configure:23022: result: yes
configure:23026: checking malloc.h presence
configure:23036: gcc -E conftest.c
configure:23042: $? = 0
configure:23062: result: yes
configure:23097: checking for malloc.h
configure:23104: result: yes
configure:22972: checking for memory.h
configure:22977: result: yes
configure:22972: checking for stdlib.h
configure:22977: result: yes
configure:22981: checking stdio.h usability
configure:22993: gcc -c -std=iso9899:1990 -W -Wall -Wchar-subscripts -Wshadow -Wpointer-arith -Wmissing-prototypes -Wwrite-strings -D_XOPEN_SOURCE=500 -D_BSD_SOURCE -g -O2 -fno-schedule-insns -fno-inline -Wformat-security -Wmissing-format-attribute conftest.c >&5
configure:22999: $? = 0
configure:23003: test -z
|| test ! -s conftest.err
configure:23006: $? = 0
configure:23009: test -s conftest.o
configure:23012: $? = 0
configure:23022: result: yes
configure:23026: checking stdio.h presence
configure:23036: gcc -E conftest.c
configure:23042: $? = 0
configure:23062: result: yes
configure:23097: checking for stdio.h
configure:23104: result: yes
configure:22981: checking ctype.h usability
configure:22993: gcc -c -std=iso9899:1990 -W -Wall -Wchar-subscripts -Wshadow -Wpointer-arith -Wmissing-prototypes -Wwrite-strings -D_XOPEN_SOURCE=500 -D_BSD_SOURCE -g -O2 -fno-schedule-insns -fno-inline -Wformat-security -Wmissing-format-attribute conftest.c >&5
configure:22999: $? = 0
configure:23003: test -z
|| test ! -s conftest.err
configure:23006: $? = 0
configure:23009: test -s conftest.o
configure:23012: $? = 0
configure:23022: result: yes
configure:23026: checking ctype.h presence
configure:23036: gcc -E conftest.c
configure:23042: $? = 0
configure:23062: result: yes
configure:23097: checking for ctype.h
configure:23104: result: yes
configure:22972: checking for dlfcn.h
configure:22977: result: yes
configure:22981: checking dl.h usability
configure:22993: gcc -c -std=iso9899:1990 -W -Wall -Wchar-subscripts -Wshadow -Wpointer-arith -Wmissing-prototypes -Wwrite-strings -D_XOPEN_SOURCE=500 -D_BSD_SOURCE -g -O2 -fno-schedule-insns -fno-inline -Wformat-security -Wmissing-format-attribute conftest.c >&5
conftest.c:72:16: error: dl.h: No such file or directory
configure:22999: $? = 1
configure: failed program was:
| /* confdefs.h. */
|
| #define PACKAGE_NAME ""
| #define PACKAGE_TARNAME ""
| #define PACKAGE_VERSION ""
| #define PACKAGE_STRING ""
| #define PACKAGE_BUGREPORT ""
| #define PACKAGE "arts"
| #define VERSION "1.5.1"
| #ifdef __cplusplus
| void exit (int);
| #endif
| #define KDELIBSUFF "64"
| #define STDC_HEADERS 1
| #define HAVE_SYS_TYPES_H 1
| #define HAVE_SYS_STAT_H 1
| #define HAVE_STDLIB_H 1
| #define HAVE_STRING_H 1
| #define HAVE_MEMORY_H 1
| #define HAVE_STRINGS_H 1
| #define HAVE_INTTYPES_H 1
| #define HAVE_STDINT_H 1
| #define HAVE_UNISTD_H 1
| #define HAVE_DLFCN_H 1
| #define LTDL_SHLIBPATH_VAR "LD_LIBRARY_PATH"
| #define LTDL_SYSSEARCHPATH "/lib64:/usr/lib64"
| #define LTDL_OBJDIR ".libs/"
| #define HAVE_PRELOADED_SYMBOLS 1
| #define HAVE_LIBDL 1
| #define HAVE_DLERROR 1
| #define HAVE_MALLOC_H 1
| #define HAVE_MEMORY_H 1
| #define HAVE_STDLIB_H 1
| #define HAVE_STDIO_H 1
| #define HAVE_CTYPE_H 1
| #define HAVE_DLFCN_H 1
| /* end confdefs.h. */
| #include
| #if HAVE_SYS_TYPES_H
| # include
| #endif
| #if HAVE_SYS_STAT_H
| # include
| #endif
| #if STDC_HEADERS
| # include
| # include
| #else
| # if HAVE_STDLIB_H
| # include
| # endif
| #endif
| #if HAVE_STRING_H
| # if !STDC_HEADERS && HAVE_MEMORY_H
| # include
| # endif
| # include
| #endif
| #if HAVE_STRINGS_H
| # include
| #endif
| #if HAVE_INTTYPES_H
| # include
| #else
| # if HAVE_STDINT_H
| # include
| # endif
| #endif
| #if HAVE_UNISTD_H
| # include
| #endif
| #include
configure:23022: result: no
configure:23026: checking dl.h presence
configure:23036: gcc -E conftest.c
conftest.c:38:16: error: dl.h: No such file or directory
configure:23042: $? = 1
configure: failed program was:
| /* confdefs.h. */
|
| #define PACKAGE_NAME ""
| #define PACKAGE_TARNAME ""
| #define PACKAGE_VERSION ""
| #define PACKAGE_STRING ""
| #define PACKAGE_BUGREPORT ""
| #define PACKAGE "arts"
| #define VERSION "1.5.1"
| #ifdef __cplusplus
| void exit (int);
| #endif
| #define KDELIBSUFF "64"
| #define STDC_HEADERS 1
| #define HAVE_SYS_TYPES_H 1
| #define HAVE_SYS_STAT_H 1
| #define HAVE_STDLIB_H 1
| #define HAVE_STRING_H 1
| #define HAVE_MEMORY_H 1
| #define HAVE_STRINGS_H 1
| #define HAVE_INTTYPES_H 1
| #define HAVE_STDINT_H 1
| #define HAVE_UNISTD_H 1
| #define HAVE_DLFCN_H 1
| #define LTDL_SHLIBPATH_VAR "LD_LIBRARY_PATH"
| #define LTDL_SYSSEARCHPATH "/lib64:/usr/lib64"
| #define LTDL_OBJDIR ".libs/"
| #define HAVE_PRELOADED_SYMBOLS 1
| #define HAVE_LIBDL 1
| #define HAVE_DLERROR 1
| #define HAVE_MALLOC_H 1
| #define HAVE_MEMORY_H 1
| #define HAVE_STDLIB_H 1
| #define HAVE_STDIO_H 1
| #define HAVE_CTYPE_H 1
| #define HAVE_DLFCN_H 1
| /* end confdefs.h. */
| #include
configure:23062: result: no
configure:23097: checking for dl.h
configure:23104: result: no
configure:22981: checking dld.h usability
configure:22993: gcc -c -std=iso9899:1990 -W -Wall -Wchar-subscripts -Wshadow -Wpointer-arith -Wmissing-prototypes -Wwrite-strings -D_XOPEN_SOURCE=500 -D_BSD_SOURCE -g -O2 -fno-schedule-insns -fno-inline -Wformat-security -Wmissing-format-attribute conftest.c >&5
conftest.c:72:17: error: dld.h: No such file or directory
configure:22999: $? = 1
configure: failed program was:
| /* confdefs.h. */
|
| #define PACKAGE_NAME ""
| #define PACKAGE_TARNAME ""
| #define PACKAGE_VERSION ""
| #define PACKAGE_STRING ""
| #define PACKAGE_BUGREPORT ""
| #define PACKAGE "arts"
| #define VERSION "1.5.1"
| #ifdef __cplusplus
| void exit (int);
| #endif
| #define KDELIBSUFF "64"
| #define STDC_HEADERS 1
| #define HAVE_SYS_TYPES_H 1
| #define HAVE_SYS_STAT_H 1
| #define HAVE_STDLIB_H 1
| #define HAVE_STRING_H 1
| #define HAVE_MEMORY_H 1
| #define HAVE_STRINGS_H 1
| #define HAVE_INTTYPES_H 1
| #define HAVE_STDINT_H 1
| #define HAVE_UNISTD_H 1
| #define HAVE_DLFCN_H 1
| #define LTDL_SHLIBPATH_VAR "LD_LIBRARY_PATH"
| #define LTDL_SYSSEARCHPATH "/lib64:/usr/lib64"
| #define LTDL_OBJDIR ".libs/"
| #define HAVE_PRELOADED_SYMBOLS 1
| #define HAVE_LIBDL 1
| #define HAVE_DLERROR 1
| #define HAVE_MALLOC_H 1
| #define HAVE_MEMORY_H 1
| #define HAVE_STDLIB_H 1
| #define HAVE_STDIO_H 1
| #define HAVE_CTYPE_H 1
| #define HAVE_DLFCN_H 1
| /* end confdefs.h. */
| #include
| #if HAVE_SYS_TYPES_H
| # include
| #endif
| #if HAVE_SYS_STAT_H
| # include
| #endif
| #if STDC_HEADERS
| # include
| # include
| #else
| # if HAVE_STDLIB_H
| # include
| # endif
| #endif
| #if HAVE_STRING_H
| # if !STDC_HEADERS && HAVE_MEMORY_H
| # include
| # endif
| # include
| #endif
| #if HAVE_STRINGS_H
| # include
| #endif
| #if HAVE_INTTYPES_H
| # include
| #else
| # if HAVE_STDINT_H
| # include
| # endif
| #endif
| #if HAVE_UNISTD_H
| # include
| #endif
| #include
configure:23022: result: no
configure:23026: checking dld.h presence
configure:23036: gcc -E conftest.c
conftest.c:38:17: error: dld.h: No such file or directory
configure:23042: $? = 1
configure: failed program was:
| /* confdefs.h. */
|
| #define PACKAGE_NAME ""
| #define PACKAGE_TARNAME ""
| #define PACKAGE_VERSION ""
| #define PACKAGE_STRING ""
| #define PACKAGE_BUGREPORT ""
| #define PACKAGE "arts"
| #define VERSION "1.5.1"
| #ifdef __cplusplus
| void exit (int);
| #endif
| #define KDELIBSUFF "64"
| #define STDC_HEADERS 1
| #define HAVE_SYS_TYPES_H 1
| #define HAVE_SYS_STAT_H 1
| #define HAVE_STDLIB_H 1
| #define HAVE_STRING_H 1
| #define HAVE_MEMORY_H 1
| #define HAVE_STRINGS_H 1
| #define HAVE_INTTYPES_H 1
| #define HAVE_STDINT_H 1
| #define HAVE_UNISTD_H 1
| #define HAVE_DLFCN_H 1
| #define LTDL_SHLIBPATH_VAR "LD_LIBRARY_PATH"
| #define LTDL_SYSSEARCHPATH "/lib64:/usr/lib64"
| #define LTDL_OBJDIR ".libs/"
| #define HAVE_PRELOADED_SYMBOLS 1
| #define HAVE_LIBDL 1
| #define HAVE_DLERROR 1
| #define HAVE_MALLOC_H 1
| #define HAVE_MEMORY_H 1
| #define HAVE_STDLIB_H 1
| #define HAVE_STDIO_H 1
| #define HAVE_CTYPE_H 1
| #define HAVE_DLFCN_H 1
| /* end confdefs.h. */
| #include
configure:23062: result: no
configure:23097: checking for dld.h
configure:23104: result: no
configure:23123: checking for string.h
configure:23128: result: yes
configure:23273: checking for strchr
configure:23330: gcc -o conftest -std=iso9899:1990 -W -Wall -Wchar-subscripts -Wshadow -Wpointer-arith -Wmissing-prototypes -Wwrite-strings -D_XOPEN_SOURCE=500 -D_BSD_SOURCE -g -O2 -fno-schedule-insns -fno-inline -Wformat-security -Wmissing-format-attribute conftest.c >&5
conftest.c:63: warning: conflicting types for built-in function 'strchr'
configure:23336: $? = 0
configure:23340: test -z
|| test ! -s conftest.err
configure:23343: $? = 0
configure:23346: test -s conftest
configure:23349: $? = 0
configure:23361: result: yes
configure:23376: checking for strrchr
configure:23433: gcc -o conftest -std=iso9899:1990 -W -Wall -Wchar-subscripts -Wshadow -Wpointer-arith -Wmissing-prototypes -Wwrite-strings -D_XOPEN_SOURCE=500 -D_BSD_SOURCE -g -O2 -fno-schedule-insns -fno-inline -Wformat-security -Wmissing-format-attribute conftest.c >&5
conftest.c:64: warning: conflicting types for built-in function 'strrchr'
configure:23439: $? = 0
configure:23443: test -z
|| test ! -s conftest.err
configure:23446: $? = 0
configure:23449: test -s conftest
configure:23452: $? = 0
configure:23464: result: yes
configure:23479: checking for memcpy
configure:23536: gcc -o conftest -std=iso9899:1990 -W -Wall -Wchar-subscripts -Wshadow -Wpointer-arith -Wmissing-prototypes -Wwrite-strings -D_XOPEN_SOURCE=500 -D_BSD_SOURCE -g -O2 -fno-schedule-insns -fno-inline -Wformat-security -Wmissing-format-attribute conftest.c >&5
conftest.c:65: warning: conflicting types for built-in function 'memcpy'
configure:23542: $? = 0
configure:23546: test -z
|| test ! -s conftest.err
configure:23549: $? = 0
configure:23552: test -s conftest
configure:23555: $? = 0
configure:23567: result: yes
configure:23581: checking for strcmp
configure:23638: gcc -o conftest -std=iso9899:1990 -W -Wall -Wchar-subscripts -Wshadow -Wpointer-arith -Wmissing-prototypes -Wwrite-strings -D_XOPEN_SOURCE=500 -D_BSD_SOURCE -g -O2 -fno-schedule-insns -fno-inline -Wformat-security -Wmissing-format-attribute conftest.c >&5
conftest.c:66: warning: conflicting types for built-in function 'strcmp'
configure:23644: $? = 0
configure:23648: test -z
|| test ! -s conftest.err
configure:23651: $? = 0
configure:23654: test -s conftest
configure:23657: $? = 0
configure:23669: result: yes
configure:23691: checking for extra includes
configure:23719: result: no
configure:23723: checking for extra libs
configure:23752: result: no
configure:23758: checking for strlcat
configure:23806: g++ -c -ansi -D_XOPEN_SOURCE=500 -D_BSD_SOURCE -Wcast-align -Wconversion -Wchar-subscripts -Wall -W -Wpointer-arith -pipe -march=athlon-xp -m3dnow conftest.cc >&5
conftest.cc:1: error: CPU you selected does not support x86-64 instruction set
conftest.cc:1: error: CPU you selected does not support x86-64 instruction set
configure:23812: $? = 1
configure: failed program was:
| /* confdefs.h. */
|
| #define PACKAGE_NAME ""
| #define PACKAGE_TARNAME ""
| #define PACKAGE_VERSION ""
| #define PACKAGE_STRING ""
| #define PACKAGE_BUGREPORT ""
| #define PACKAGE "arts"
| #define VERSION "1.5.1"
| #ifdef __cplusplus
| void exit (int);
| #endif
| #define KDELIBSUFF "64"
| #define STDC_HEADERS 1
| #define HAVE_SYS_TYPES_H 1
| #define HAVE_SYS_STAT_H 1
| #define HAVE_STDLIB_H 1
| #define HAVE_STRING_H 1
| #define HAVE_MEMORY_H 1
| #define HAVE_STRINGS_H 1
| #define HAVE_INTTYPES_H 1
| #define HAVE_STDINT_H 1
| #define HAVE_UNISTD_H 1
| #define HAVE_DLFCN_H 1
| #define LTDL_SHLIBPATH_VAR "LD_LIBRARY_PATH"
| #define LTDL_SYSSEARCHPATH "/lib64:/usr/lib64"
| #define LTDL_OBJDIR ".libs/"
| #define HAVE_PRELOADED_SYMBOLS 1
| #define HAVE_LIBDL 1
| #define HAVE_DLERROR 1
| #define HAVE_MALLOC_H 1
| #define HAVE_MEMORY_H 1
| #define HAVE_STDLIB_H 1
| #define HAVE_STDIO_H 1
| #define HAVE_CTYPE_H 1
| #define HAVE_DLFCN_H 1
| #define HAVE_STRING_H 1
| #define HAVE_STRCHR 1
| #define HAVE_STRRCHR 1
| #define HAVE_MEMCPY 1
| #define HAVE_STRCMP 1
| /* end confdefs.h. */
|
|
| #include
|
|
| int
| main ()
| {
|
| char buf[20];
| buf[0]='\0';
| strlcat(buf, "KDE function test", sizeof(buf));
|
|
| ;
| return 0;
| }
configure:23847: result: no
configure:23850: checking if strlcat needs custom prototype
configure:23954: result: yes - in libkdefakes
configure:23979: checking for strlcpy
configure:24026: g++ -c -ansi -D_XOPEN_SOURCE=500 -D_BSD_SOURCE -Wcast-align -Wconversion -Wchar-subscripts -Wall -W -Wpointer-arith -pipe -march=athlon-xp -m3dnow conftest.cc >&5
conftest.cc:1: error: CPU you selected does not support x86-64 instruction set
conftest.cc:1: error: CPU you selected does not support x86-64 instruction set
configure:24032: $? = 1
configure: failed program was:
| /* confdefs.h. */
|
| #define PACKAGE_NAME ""
| #define PACKAGE_TARNAME ""
| #define PACKAGE_VERSION ""
| #define PACKAGE_STRING ""
| #define PACKAGE_BUGREPORT ""
| #define PACKAGE "arts"
| #define VERSION "1.5.1"
| #ifdef __cplusplus
| void exit (int);
| #endif
| #define KDELIBSUFF "64"
| #define STDC_HEADERS 1
| #define HAVE_SYS_TYPES_H 1
| #define HAVE_SYS_STAT_H 1
| #define HAVE_STDLIB_H 1
| #define HAVE_STRING_H 1
| #define HAVE_MEMORY_H 1
| #define HAVE_STRINGS_H 1
| #define HAVE_INTTYPES_H 1
| #define HAVE_STDINT_H 1
| #define HAVE_UNISTD_H 1
| #define HAVE_DLFCN_H 1
| #define LTDL_SHLIBPATH_VAR "LD_LIBRARY_PATH"
| #define LTDL_SYSSEARCHPATH "/lib64:/usr/lib64"
| #define LTDL_OBJDIR ".libs/"
| #define HAVE_PRELOADED_SYMBOLS 1
| #define HAVE_LIBDL 1
| #define HAVE_DLERROR 1
| #define HAVE_MALLOC_H 1
| #define HAVE_MEMORY_H 1
| #define HAVE_STDLIB_H 1
| #define HAVE_STDIO_H 1
| #define HAVE_CTYPE_H 1
| #define HAVE_DLFCN_H 1
| #define HAVE_STRING_H 1
| #define HAVE_STRCHR 1
| #define HAVE_STRRCHR 1
| #define HAVE_MEMCPY 1
| #define HAVE_STRCMP 1
| /* end confdefs.h. */
|
|
| #include
|
|
| int
| main ()
| {
|
| char buf[20];
| strlcpy(buf, "KDE function test", sizeof(buf));
|
|
| ;
| return 0;
| }
configure:24067: result: no
configure:24070: checking if strlcpy needs custom prototype
configure:24173: result: yes - in libkdefakes
configure:24197: checking for main in -lutil
configure:24221: gcc -o conftest -std=iso9899:1990 -W -Wall -Wchar-subscripts -Wshadow -Wpointer-arith -Wmissing-prototypes -Wwrite-strings -D_XOPEN_SOURCE=500 -D_BSD_SOURCE -g -O2 -fno-schedule-insns -fno-inline -Wformat-security -Wmissing-format-attribute conftest.c -lutil >&5
configure:24227: $? = 0
configure:24231: test -z
|| test ! -s conftest.err
configure:24234: $? = 0
configure:24237: test -s conftest
configure:24240: $? = 0
configure:24253: result: yes
configure:24259: checking for main in -lcompat
configure:24283: gcc -o conftest -std=iso9899:1990 -W -Wall -Wchar-subscripts -Wshadow -Wpointer-arith -Wmissing-prototypes -Wwrite-strings -D_XOPEN_SOURCE=500 -D_BSD_SOURCE -g -O2 -fno-schedule-insns -fno-inline -Wformat-security -Wmissing-format-attribute conftest.c -lcompat >&5
/usr/lib64/gcc/x86_64-suse-linux/4.0.2/../../../../x86_64-suse-linux/bin/ld: cannot find -lcompat
collect2: ld returned 1 exit status
configure:24289: $? = 1
configure: failed program was:
| /* confdefs.h. */
|
| #define PACKAGE_NAME ""
| #define PACKAGE_TARNAME ""
| #define PACKAGE_VERSION ""
| #define PACKAGE_STRING ""
| #define PACKAGE_BUGREPORT ""
| #define PACKAGE "arts"
| #define VERSION "1.5.1"
| #ifdef __cplusplus
| void exit (int);
| #endif
| #define KDELIBSUFF "64"
| #define STDC_HEADERS 1
| #define HAVE_SYS_TYPES_H 1
| #define HAVE_SYS_STAT_H 1
| #define HAVE_STDLIB_H 1
| #define HAVE_STRING_H 1
| #define HAVE_MEMORY_H 1
| #define HAVE_STRINGS_H 1
| #define HAVE_INTTYPES_H 1
| #define HAVE_STDINT_H 1
| #define HAVE_UNISTD_H 1
| #define HAVE_DLFCN_H 1
| #define LTDL_SHLIBPATH_VAR "LD_LIBRARY_PATH"
| #define LTDL_SYSSEARCHPATH "/lib64:/usr/lib64"
| #define LTDL_OBJDIR ".libs/"
| #define HAVE_PRELOADED_SYMBOLS 1
| #define HAVE_LIBDL 1
| #define HAVE_DLERROR 1
| #define HAVE_MALLOC_H 1
| #define HAVE_MEMORY_H 1
| #define HAVE_STDLIB_H 1
| #define HAVE_STDIO_H 1
| #define HAVE_CTYPE_H 1
| #define HAVE_DLFCN_H 1
| #define HAVE_STRING_H 1
| #define HAVE_STRCHR 1
| #define HAVE_STRRCHR 1
| #define HAVE_MEMCPY 1
| #define HAVE_STRCMP 1
| /* end confdefs.h. */
|
|
| int
| main ()
| {
| main ();
| ;
| return 0;
| }
configure:24315: result: no
configure:24322: checking for crypt in -lcrypt
configure:24352: gcc -o conftest -std=iso9899:1990 -W -Wall -Wchar-subscripts -Wshadow -Wpointer-arith -Wmissing-prototypes -Wwrite-strings -D_XOPEN_SOURCE=500 -D_BSD_SOURCE -g -O2 -fno-schedule-insns -fno-inline -Wformat-security -Wmissing-format-attribute conftest.c -lcrypt >&5
configure:24358: $? = 0
configure:24362: test -z
|| test ! -s conftest.err
configure:24365: $? = 0
configure:24368: test -s conftest
configure:24371: $? = 0
configure:24384: result: yes
configure:24478: checking for socklen_t
configure:24513: g++ -c -ansi -D_XOPEN_SOURCE=500 -D_BSD_SOURCE -Wcast-align -Wconversion -Wchar-subscripts -Wall -W -Wpointer-arith -pipe -march=athlon-xp -m3dnow conftest.cc >&5
conftest.cc:1: error: CPU you selected does not support x86-64 instruction set
conftest.cc:1: error: CPU you selected does not support x86-64 instruction set
configure:24519: $? = 1
configure: failed program was:
| /* confdefs.h. */
|
| #define PACKAGE_NAME ""
| #define PACKAGE_TARNAME ""
| #define PACKAGE_VERSION ""
| #define PACKAGE_STRING ""
| #define PACKAGE_BUGREPORT ""
| #define PACKAGE "arts"
| #define VERSION "1.5.1"
| #ifdef __cplusplus
| void exit (int);
| #endif
| #define KDELIBSUFF "64"
| #define STDC_HEADERS 1
| #define HAVE_SYS_TYPES_H 1
| #define HAVE_SYS_STAT_H 1
| #define HAVE_STDLIB_H 1
| #define HAVE_STRING_H 1
| #define HAVE_MEMORY_H 1
| #define HAVE_STRINGS_H 1
| #define HAVE_INTTYPES_H 1
| #define HAVE_STDINT_H 1
| #define HAVE_UNISTD_H 1
| #define HAVE_DLFCN_H 1
| #define LTDL_SHLIBPATH_VAR "LD_LIBRARY_PATH"
| #define LTDL_SYSSEARCHPATH "/lib64:/usr/lib64"
| #define LTDL_OBJDIR ".libs/"
| #define HAVE_PRELOADED_SYMBOLS 1
| #define HAVE_LIBDL 1
| #define HAVE_DLERROR 1
| #define HAVE_MALLOC_H 1
| #define HAVE_MEMORY_H 1
| #define HAVE_STDLIB_H 1
| #define HAVE_STDIO_H 1
| #define HAVE_CTYPE_H 1
| #define HAVE_DLFCN_H 1
| #define HAVE_STRING_H 1
| #define HAVE_STRCHR 1
| #define HAVE_STRRCHR 1
| #define HAVE_MEMCPY 1
| #define HAVE_STRCMP 1
| #define HAVE_CRYPT 1
| /* end confdefs.h. */
|
| #include
| #include
|
| int
| main ()
| {
|
| socklen_t len;
| getpeername(0,0,&len);
|
| ;
| return 0;
| }
configure:24553: result: no
configure:24556: checking for socklen_t equivalent for socket functions
configure:24592: g++ -c -ansi -D_XOPEN_SOURCE=500 -D_BSD_SOURCE -Wcast-align -Wconversion -Wchar-subscripts -Wall -W -Wpointer-arith -pipe -march=athlon-xp -m3dnow conftest.cc >&5
conftest.cc:1: error: CPU you selected does not support x86-64 instruction set
conftest.cc:1: error: CPU you selected does not support x86-64 instruction set
configure:24598: $? = 1
configure: failed program was:
| /* confdefs.h. */
|
| #define PACKAGE_NAME ""
| #define PACKAGE_TARNAME ""
| #define PACKAGE_VERSION ""
| #define PACKAGE_STRING ""
| #define PACKAGE_BUGREPORT ""
| #define PACKAGE "arts"
| #define VERSION "1.5.1"
| #ifdef __cplusplus
| void exit (int);
| #endif
| #define KDELIBSUFF "64"
| #define STDC_HEADERS 1
| #define HAVE_SYS_TYPES_H 1
| #define HAVE_SYS_STAT_H 1
| #define HAVE_STDLIB_H 1
| #define HAVE_STRING_H 1
| #define HAVE_MEMORY_H 1
| #define HAVE_STRINGS_H 1
| #define HAVE_INTTYPES_H 1
| #define HAVE_STDINT_H 1
| #define HAVE_UNISTD_H 1
| #define HAVE_DLFCN_H 1
| #define LTDL_SHLIBPATH_VAR "LD_LIBRARY_PATH"
| #define LTDL_SYSSEARCHPATH "/lib64:/usr/lib64"
| #define LTDL_OBJDIR ".libs/"
| #define HAVE_PRELOADED_SYMBOLS 1
| #define HAVE_LIBDL 1
| #define HAVE_DLERROR 1
| #define HAVE_MALLOC_H 1
| #define HAVE_MEMORY_H 1
| #define HAVE_STDLIB_H 1
| #define HAVE_STDIO_H 1
| #define HAVE_CTYPE_H 1
| #define HAVE_DLFCN_H 1
| #define HAVE_STRING_H 1
| #define HAVE_STRCHR 1
| #define HAVE_STRRCHR 1
| #define HAVE_MEMCPY 1
| #define HAVE_STRCMP 1
| #define HAVE_CRYPT 1
| /* end confdefs.h. */
|
| #include
| #include
|
| int
| main ()
| {
|
| int len;
| getpeername(0,0,&len);
|
| ;
| return 0;
| }
configure:24592: g++ -c -ansi -D_XOPEN_SOURCE=500 -D_BSD_SOURCE -Wcast-align -Wconversion -Wchar-subscripts -Wall -W -Wpointer-arith -pipe -march=athlon-xp -m3dnow conftest.cc >&5
conftest.cc:1: error: CPU you selected does not support x86-64 instruction set
conftest.cc:1: error: CPU you selected does not support x86-64 instruction set
configure:24598: $? = 1
configure: failed program was:
| /* confdefs.h. */
|
| #define PACKAGE_NAME ""
| #define PACKAGE_TARNAME ""
| #define PACKAGE_VERSION ""
| #define PACKAGE_STRING ""
| #define PACKAGE_BUGREPORT ""
| #define PACKAGE "arts"
| #define VERSION "1.5.1"
| #ifdef __cplusplus
| void exit (int);
| #endif
| #define KDELIBSUFF "64"
| #define STDC_HEADERS 1
| #define HAVE_SYS_TYPES_H 1
| #define HAVE_SYS_STAT_H 1
| #define HAVE_STDLIB_H 1
| #define HAVE_STRING_H 1
| #define HAVE_MEMORY_H 1
| #define HAVE_STRINGS_H 1
| #define HAVE_INTTYPES_H 1
| #define HAVE_STDINT_H 1
| #define HAVE_UNISTD_H 1
| #define HAVE_DLFCN_H 1
| #define LTDL_SHLIBPATH_VAR "LD_LIBRARY_PATH"
| #define LTDL_SYSSEARCHPATH "/lib64:/usr/lib64"
| #define LTDL_OBJDIR ".libs/"
| #define HAVE_PRELOADED_SYMBOLS 1
| #define HAVE_LIBDL 1
| #define HAVE_DLERROR 1
| #define HAVE_MALLOC_H 1
| #define HAVE_MEMORY_H 1
| #define HAVE_STDLIB_H 1
| #define HAVE_STDIO_H 1
| #define HAVE_CTYPE_H 1
| #define HAVE_DLFCN_H 1
| #define HAVE_STRING_H 1
| #define HAVE_STRCHR 1
| #define HAVE_STRRCHR 1
| #define HAVE_MEMCPY 1
| #define HAVE_STRCMP 1
| #define HAVE_CRYPT 1
| /* end confdefs.h. */
|
| #include
| #include
|
| int
| main ()
| {
|
| size_t len;
| getpeername(0,0,&len);
|
| ;
| return 0;
| }
configure:24592: g++ -c -ansi -D_XOPEN_SOURCE=500 -D_BSD_SOURCE -Wcast-align -Wconversion -Wchar-subscripts -Wall -W -Wpointer-arith -pipe -march=athlon-xp -m3dnow conftest.cc >&5
conftest.cc:1: error: CPU you selected does not support x86-64 instruction set
conftest.cc:1: error: CPU you selected does not support x86-64 instruction set
configure:24598: $? = 1
configure: failed program was:
| /* confdefs.h. */
|
| #define PACKAGE_NAME ""
| #define PACKAGE_TARNAME ""
| #define PACKAGE_VERSION ""
| #define PACKAGE_STRING ""
| #define PACKAGE_BUGREPORT ""
| #define PACKAGE "arts"
| #define VERSION "1.5.1"
| #ifdef __cplusplus
| void exit (int);
| #endif
| #define KDELIBSUFF "64"
| #define STDC_HEADERS 1
| #define HAVE_SYS_TYPES_H 1
| #define HAVE_SYS_STAT_H 1
| #define HAVE_STDLIB_H 1
| #define HAVE_STRING_H 1
| #define HAVE_MEMORY_H 1
| #define HAVE_STRINGS_H 1
| #define HAVE_INTTYPES_H 1
| #define HAVE_STDINT_H 1
| #define HAVE_UNISTD_H 1
| #define HAVE_DLFCN_H 1
| #define LTDL_SHLIBPATH_VAR "LD_LIBRARY_PATH"
| #define LTDL_SYSSEARCHPATH "/lib64:/usr/lib64"
| #define LTDL_OBJDIR ".libs/"
| #define HAVE_PRELOADED_SYMBOLS 1
| #define HAVE_LIBDL 1
| #define HAVE_DLERROR 1
| #define HAVE_MALLOC_H 1
| #define HAVE_MEMORY_H 1
| #define HAVE_STDLIB_H 1
| #define HAVE_STDIO_H 1
| #define HAVE_CTYPE_H 1
| #define HAVE_DLFCN_H 1
| #define HAVE_STRING_H 1
| #define HAVE_STRCHR 1
| #define HAVE_STRRCHR 1
| #define HAVE_MEMCPY 1
| #define HAVE_STRCMP 1
| #define HAVE_CRYPT 1
| /* end confdefs.h. */
|
| #include
| #include
|
| int
| main ()
| {
|
| unsigned len;
| getpeername(0,0,&len);
|
| ;
| return 0;
| }
configure:24592: g++ -c -ansi -D_XOPEN_SOURCE=500 -D_BSD_SOURCE -Wcast-align -Wconversion -Wchar-subscripts -Wall -W -Wpointer-arith -pipe -march=athlon-xp -m3dnow conftest.cc >&5
conftest.cc:1: error: CPU you selected does not support x86-64 instruction set
conftest.cc:1: error: CPU you selected does not support x86-64 instruction set
configure:24598: $? = 1
configure: failed program was:
| /* confdefs.h. */
|
| #define PACKAGE_NAME ""
| #define PACKAGE_TARNAME ""
| #define PACKAGE_VERSION ""
| #define PACKAGE_STRING ""
| #define PACKAGE_BUGREPORT ""
| #define PACKAGE "arts"
| #define VERSION "1.5.1"
| #ifdef __cplusplus
| void exit (int);
| #endif
| #define KDELIBSUFF "64"
| #define STDC_HEADERS 1
| #define HAVE_SYS_TYPES_H 1
| #define HAVE_SYS_STAT_H 1
| #define HAVE_STDLIB_H 1
| #define HAVE_STRING_H 1
| #define HAVE_MEMORY_H 1
| #define HAVE_STRINGS_H 1
| #define HAVE_INTTYPES_H 1
| #define HAVE_STDINT_H 1
| #define HAVE_UNISTD_H 1
| #define HAVE_DLFCN_H 1
| #define LTDL_SHLIBPATH_VAR "LD_LIBRARY_PATH"
| #define LTDL_SYSSEARCHPATH "/lib64:/usr/lib64"
| #define LTDL_OBJDIR ".libs/"
| #define HAVE_PRELOADED_SYMBOLS 1
| #define HAVE_LIBDL 1
| #define HAVE_DLERROR 1
| #define HAVE_MALLOC_H 1
| #define HAVE_MEMORY_H 1
| #define HAVE_STDLIB_H 1
| #define HAVE_STDIO_H 1
| #define HAVE_CTYPE_H 1
| #define HAVE_DLFCN_H 1
| #define HAVE_STRING_H 1
| #define HAVE_STRCHR 1
| #define HAVE_STRRCHR 1
| #define HAVE_MEMCPY 1
| #define HAVE_STRCMP 1
| #define HAVE_CRYPT 1
| /* end confdefs.h. */
|
| #include
| #include
|
| int
| main ()
| {
|
| long len;
| getpeername(0,0,&len);
|
| ;
| return 0;
| }
configure:24592: g++ -c -ansi -D_XOPEN_SOURCE=500 -D_BSD_SOURCE -Wcast-align -Wconversion -Wchar-subscripts -Wall -W -Wpointer-arith -pipe -march=athlon-xp -m3dnow conftest.cc >&5
conftest.cc:1: error: CPU you selected does not support x86-64 instruction set
conftest.cc:1: error: CPU you selected does not support x86-64 instruction set
configure:24598: $? = 1
configure: failed program was:
| /* confdefs.h. */
|
| #define PACKAGE_NAME ""
| #define PACKAGE_TARNAME ""
| #define PACKAGE_VERSION ""
| #define PACKAGE_STRING ""
| #define PACKAGE_BUGREPORT ""
| #define PACKAGE "arts"
| #define VERSION "1.5.1"
| #ifdef __cplusplus
| void exit (int);
| #endif
| #define KDELIBSUFF "64"
| #define STDC_HEADERS 1
| #define HAVE_SYS_TYPES_H 1
| #define HAVE_SYS_STAT_H 1
| #define HAVE_STDLIB_H 1
| #define HAVE_STRING_H 1
| #define HAVE_MEMORY_H 1
| #define HAVE_STRINGS_H 1
| #define HAVE_INTTYPES_H 1
| #define HAVE_STDINT_H 1
| #define HAVE_UNISTD_H 1
| #define HAVE_DLFCN_H 1
| #define LTDL_SHLIBPATH_VAR "LD_LIBRARY_PATH"
| #define LTDL_SYSSEARCHPATH "/lib64:/usr/lib64"
| #define LTDL_OBJDIR ".libs/"
| #define HAVE_PRELOADED_SYMBOLS 1
| #define HAVE_LIBDL 1
| #define HAVE_DLERROR 1
| #define HAVE_MALLOC_H 1
| #define HAVE_MEMORY_H 1
| #define HAVE_STDLIB_H 1
| #define HAVE_STDIO_H 1
| #define HAVE_CTYPE_H 1
| #define HAVE_DLFCN_H 1
| #define HAVE_STRING_H 1
| #define HAVE_STRCHR 1
| #define HAVE_STRRCHR 1
| #define HAVE_MEMCPY 1
| #define HAVE_STRCMP 1
| #define HAVE_CRYPT 1
| /* end confdefs.h. */
|
| #include
| #include
|
| int
| main ()
| {
|
| unsigned long len;
| getpeername(0,0,&len);
|
| ;
| return 0;
| }
configure:24633: result: int
configure:24647: checking for dnet_ntoa in -ldnet
configure:24677: gcc -o conftest -std=iso9899:1990 -W -Wall -Wchar-subscripts -Wshadow -Wpointer-arith -Wmissing-prototypes -Wwrite-strings -D_XOPEN_SOURCE=500 -D_BSD_SOURCE -g -O2 -fno-schedule-insns -fno-inline -Wformat-security -Wmissing-format-attribute conftest.c -ldnet >&5
/usr/lib64/gcc/x86_64-suse-linux/4.0.2/../../../../x86_64-suse-linux/bin/ld: cannot find -ldnet
collect2: ld returned 1 exit status
configure:24683: $? = 1
configure: failed program was:
| /* confdefs.h. */
|
| #define PACKAGE_NAME ""
| #define PACKAGE_TARNAME ""
| #define PACKAGE_VERSION ""
| #define PACKAGE_STRING ""
| #define PACKAGE_BUGREPORT ""
| #define PACKAGE "arts"
| #define VERSION "1.5.1"
| #ifdef __cplusplus
| void exit (int);
| #endif
| #define KDELIBSUFF "64"
| #define STDC_HEADERS 1
| #define HAVE_SYS_TYPES_H 1
| #define HAVE_SYS_STAT_H 1
| #define HAVE_STDLIB_H 1
| #define HAVE_STRING_H 1
| #define HAVE_MEMORY_H 1
| #define HAVE_STRINGS_H 1
| #define HAVE_INTTYPES_H 1
| #define HAVE_STDINT_H 1
| #define HAVE_UNISTD_H 1
| #define HAVE_DLFCN_H 1
| #define LTDL_SHLIBPATH_VAR "LD_LIBRARY_PATH"
| #define LTDL_SYSSEARCHPATH "/lib64:/usr/lib64"
| #define LTDL_OBJDIR ".libs/"
| #define HAVE_PRELOADED_SYMBOLS 1
| #define HAVE_LIBDL 1
| #define HAVE_DLERROR 1
| #define HAVE_MALLOC_H 1
| #define HAVE_MEMORY_H 1
| #define HAVE_STDLIB_H 1
| #define HAVE_STDIO_H 1
| #define HAVE_CTYPE_H 1
| #define HAVE_DLFCN_H 1
| #define HAVE_STRING_H 1
| #define HAVE_STRCHR 1
| #define HAVE_STRRCHR 1
| #define HAVE_MEMCPY 1
| #define HAVE_STRCMP 1
| #define HAVE_CRYPT 1
| #define kde_socklen_t int
| #define ksize_t int
| /* end confdefs.h. */
|
| /* Override any gcc2 internal prototype to avoid an error. */
| #ifdef __cplusplus
| extern "C"
| #endif
| /* We use char because int might match the return type of a gcc2
| builtin and then its argument prototype would still apply. */
| char dnet_ntoa ();
| int
| main ()
| {
| dnet_ntoa ();
| ;
| return 0;
| }
configure:24709: result: no
configure:24716: checking for dnet_ntoa in -ldnet_stub
configure:24746: gcc -o conftest -std=iso9899:1990 -W -Wall -Wchar-subscripts -Wshadow -Wpointer-arith -Wmissing-prototypes -Wwrite-strings -D_XOPEN_SOURCE=500 -D_BSD_SOURCE -g -O2 -fno-schedule-insns -fno-inline -Wformat-security -Wmissing-format-attribute conftest.c -ldnet_stub >&5
/usr/lib64/gcc/x86_64-suse-linux/4.0.2/../../../../x86_64-suse-linux/bin/ld: cannot find -ldnet_stub
collect2: ld returned 1 exit status
configure:24752: $? = 1
configure: failed program was:
| /* confdefs.h. */
|
| #define PACKAGE_NAME ""
| #define PACKAGE_TARNAME ""
| #define PACKAGE_VERSION ""
| #define PACKAGE_STRING ""
| #define PACKAGE_BUGREPORT ""
| #define PACKAGE "arts"
| #define VERSION "1.5.1"
| #ifdef __cplusplus
| void exit (int);
| #endif
| #define KDELIBSUFF "64"
| #define STDC_HEADERS 1
| #define HAVE_SYS_TYPES_H 1
| #define HAVE_SYS_STAT_H 1
| #define HAVE_STDLIB_H 1
| #define HAVE_STRING_H 1
| #define HAVE_MEMORY_H 1
| #define HAVE_STRINGS_H 1
| #define HAVE_INTTYPES_H 1
| #define HAVE_STDINT_H 1
| #define HAVE_UNISTD_H 1
| #define HAVE_DLFCN_H 1
| #define LTDL_SHLIBPATH_VAR "LD_LIBRARY_PATH"
| #define LTDL_SYSSEARCHPATH "/lib64:/usr/lib64"
| #define LTDL_OBJDIR ".libs/"
| #define HAVE_PRELOADED_SYMBOLS 1
| #define HAVE_LIBDL 1
| #define HAVE_DLERROR 1
| #define HAVE_MALLOC_H 1
| #define HAVE_MEMORY_H 1
| #define HAVE_STDLIB_H 1
| #define HAVE_STDIO_H 1
| #define HAVE_CTYPE_H 1
| #define HAVE_DLFCN_H 1
| #define HAVE_STRING_H 1
| #define HAVE_STRCHR 1
| #define HAVE_STRRCHR 1
| #define HAVE_MEMCPY 1
| #define HAVE_STRCMP 1
| #define HAVE_CRYPT 1
| #define kde_socklen_t int
| #define ksize_t int
| /* end confdefs.h. */
|
| /* Override any gcc2 internal prototype to avoid an error. */
| #ifdef __cplusplus
| extern "C"
| #endif
| /* We use char because int might match the return type of a gcc2
| builtin and then its argument prototype would still apply. */
| char dnet_ntoa ();
| int
| main ()
| {
| dnet_ntoa ();
| ;
| return 0;
| }
configure:24778: result: no
configure:24785: checking for inet_ntoa
configure:24842: gcc -o conftest -std=iso9899:1990 -W -Wall -Wchar-subscripts -Wshadow -Wpointer-arith -Wmissing-prototypes -Wwrite-strings -D_XOPEN_SOURCE=500 -D_BSD_SOURCE -g -O2 -fno-schedule-insns -fno-inline -Wformat-security -Wmissing-format-attribute conftest.c >&5
configure:24848: $? = 0
configure:24852: test -z
|| test ! -s conftest.err
configure:24855: $? = 0
configure:24858: test -s conftest
configure:24861: $? = 0
configure:24873: result: yes
configure:24946: checking for connect
configure:25003: gcc -o conftest -std=iso9899:1990 -W -Wall -Wchar-subscripts -Wshadow -Wpointer-arith -Wmissing-prototypes -Wwrite-strings -D_XOPEN_SOURCE=500 -D_BSD_SOURCE -g -O2 -fno-schedule-insns -fno-inline -Wformat-security -Wmissing-format-attribute conftest.c >&5
configure:25009: $? = 0
configure:25013: test -z
|| test ! -s conftest.err
configure:25016: $? = 0
configure:25019: test -s conftest
configure:25022: $? = 0
configure:25034: result: yes
configure:25108: checking for remove
configure:25165: gcc -o conftest -std=iso9899:1990 -W -Wall -Wchar-subscripts -Wshadow -Wpointer-arith -Wmissing-prototypes -Wwrite-strings -D_XOPEN_SOURCE=500 -D_BSD_SOURCE -g -O2 -fno-schedule-insns -fno-inline -Wformat-security -Wmissing-format-attribute conftest.c >&5
configure:25171: $? = 0
configure:25175: test -z
|| test ! -s conftest.err
configure:25178: $? = 0
configure:25181: test -s conftest
configure:25184: $? = 0
configure:25196: result: yes
configure:25271: checking for shmat
configure:25328: gcc -o conftest -std=iso9899:1990 -W -Wall -Wchar-subscripts -Wshadow -Wpointer-arith -Wmissing-prototypes -Wwrite-strings -D_XOPEN_SOURCE=500 -D_BSD_SOURCE -g -O2 -fno-schedule-insns -fno-inline -Wformat-security -Wmissing-format-attribute conftest.c >&5
configure:25334: $? = 0
configure:25338: test -z
|| test ! -s conftest.err
configure:25341: $? = 0
configure:25344: test -s conftest
configure:25347: $? = 0
configure:25359: result: yes
configure:25442: checking for sys/types.h
configure:25447: result: yes
configure:25442: checking for stdint.h
configure:25447: result: yes
configure:25603: checking sys/bitypes.h usability
configure:25615: gcc -c -std=iso9899:1990 -W -Wall -Wchar-subscripts -Wshadow -Wpointer-arith -Wmissing-prototypes -Wwrite-strings -D_XOPEN_SOURCE=500 -D_BSD_SOURCE -g -O2 -fno-schedule-insns -fno-inline -Wformat-security -Wmissing-format-attribute conftest.c >&5
configure:25621: $? = 0
configure:25625: test -z
|| test ! -s conftest.err
configure:25628: $? = 0
configure:25631: test -s conftest.o
configure:25634: $? = 0
configure:25644: result: yes
configure:25648: checking sys/bitypes.h presence
configure:25658: gcc -E conftest.c
configure:25664: $? = 0
configure:25684: result: yes
configure:25719: checking for sys/bitypes.h
configure:25726: result: yes
configure:25741: checking for poll in -lpoll
configure:25771: gcc -o conftest -std=iso9899:1990 -W -Wall -Wchar-subscripts -Wshadow -Wpointer-arith -Wmissing-prototypes -Wwrite-strings -D_XOPEN_SOURCE=500 -D_BSD_SOURCE -g -O2 -fno-schedule-insns -fno-inline -Wformat-security -Wmissing-format-attribute conftest.c -lpoll >&5
/usr/lib64/gcc/x86_64-suse-linux/4.0.2/../../../../x86_64-suse-linux/bin/ld: cannot find -lpoll
collect2: ld returned 1 exit status
configure:25777: $? = 1
configure: failed program was:
| /* confdefs.h. */
|
| #define PACKAGE_NAME ""
| #define PACKAGE_TARNAME ""
| #define PACKAGE_VERSION ""
| #define PACKAGE_STRING ""
| #define PACKAGE_BUGREPORT ""
| #define PACKAGE "arts"
| #define VERSION "1.5.1"
| #ifdef __cplusplus
| void exit (int);
| #endif
| #define KDELIBSUFF "64"
| #define STDC_HEADERS 1
| #define HAVE_SYS_TYPES_H 1
| #define HAVE_SYS_STAT_H 1
| #define HAVE_STDLIB_H 1
| #define HAVE_STRING_H 1
| #define HAVE_MEMORY_H 1
| #define HAVE_STRINGS_H 1
| #define HAVE_INTTYPES_H 1
| #define HAVE_STDINT_H 1
| #define HAVE_UNISTD_H 1
| #define HAVE_DLFCN_H 1
| #define LTDL_SHLIBPATH_VAR "LD_LIBRARY_PATH"
| #define LTDL_SYSSEARCHPATH "/lib64:/usr/lib64"
| #define LTDL_OBJDIR ".libs/"
| #define HAVE_PRELOADED_SYMBOLS 1
| #define HAVE_LIBDL 1
| #define HAVE_DLERROR 1
| #define HAVE_MALLOC_H 1
| #define HAVE_MEMORY_H 1
| #define HAVE_STDLIB_H 1
| #define HAVE_STDIO_H 1
| #define HAVE_CTYPE_H 1
| #define HAVE_DLFCN_H 1
| #define HAVE_STRING_H 1
| #define HAVE_STRCHR 1
| #define HAVE_STRRCHR 1
| #define HAVE_MEMCPY 1
| #define HAVE_STRCMP 1
| #define HAVE_CRYPT 1
| #define kde_socklen_t int
| #define ksize_t int
| #define HAVE_SYS_TYPES_H 1
| #define HAVE_STDINT_H 1
| #define HAVE_SYS_BITYPES_H 1
| /* end confdefs.h. */
|
| /* Override any gcc2 internal prototype to avoid an error. */
| #ifdef __cplusplus
| extern "C"
| #endif
| /* We use char because int might match the return type of a gcc2
| builtin and then its argument prototype would still apply. */
| char poll ();
| int
| main ()
| {
| poll ();
| ;
| return 0;
| }
configure:25803: result: no
configure:25825: checking Carbon/Carbon.h usability
configure:25837: gcc -c -std=iso9899:1990 -W -Wall -Wchar-subscripts -Wshadow -Wpointer-arith -Wmissing-prototypes -Wwrite-strings -D_XOPEN_SOURCE=500 -D_BSD_SOURCE -g -O2 -fno-schedule-insns -fno-inline -Wformat-security -Wmissing-format-attribute conftest.c >&5
conftest.c:83:27: error: Carbon/Carbon.h: No such file or directory
configure:25843: $? = 1
configure: failed program was:
| /* confdefs.h. */
|
| #define PACKAGE_NAME ""
| #define PACKAGE_TARNAME ""
| #define PACKAGE_VERSION ""
| #define PACKAGE_STRING ""
| #define PACKAGE_BUGREPORT ""
| #define PACKAGE "arts"
| #define VERSION "1.5.1"
| #ifdef __cplusplus
| void exit (int);
| #endif
| #define KDELIBSUFF "64"
| #define STDC_HEADERS 1
| #define HAVE_SYS_TYPES_H 1
| #define HAVE_SYS_STAT_H 1
| #define HAVE_STDLIB_H 1
| #define HAVE_STRING_H 1
| #define HAVE_MEMORY_H 1
| #define HAVE_STRINGS_H 1
| #define HAVE_INTTYPES_H 1
| #define HAVE_STDINT_H 1
| #define HAVE_UNISTD_H 1
| #define HAVE_DLFCN_H 1
| #define LTDL_SHLIBPATH_VAR "LD_LIBRARY_PATH"
| #define LTDL_SYSSEARCHPATH "/lib64:/usr/lib64"
| #define LTDL_OBJDIR ".libs/"
| #define HAVE_PRELOADED_SYMBOLS 1
| #define HAVE_LIBDL 1
| #define HAVE_DLERROR 1
| #define HAVE_MALLOC_H 1
| #define HAVE_MEMORY_H 1
| #define HAVE_STDLIB_H 1
| #define HAVE_STDIO_H 1
| #define HAVE_CTYPE_H 1
| #define HAVE_DLFCN_H 1
| #define HAVE_STRING_H 1
| #define HAVE_STRCHR 1
| #define HAVE_STRRCHR 1
| #define HAVE_MEMCPY 1
| #define HAVE_STRCMP 1
| #define HAVE_CRYPT 1
| #define kde_socklen_t int
| #define ksize_t int
| #define HAVE_SYS_TYPES_H 1
| #define HAVE_STDINT_H 1
| #define HAVE_SYS_BITYPES_H 1
| /* end confdefs.h. */
| #include
| #if HAVE_SYS_TYPES_H
| # include
| #endif
| #if HAVE_SYS_STAT_H
| # include
| #endif
| #if STDC_HEADERS
| # include
| # include
| #else
| # if HAVE_STDLIB_H
| # include
| # endif
| #endif
| #if HAVE_STRING_H
| # if !STDC_HEADERS && HAVE_MEMORY_H
| # include
| # endif
| # include
| #endif
| #if HAVE_STRINGS_H
| # include
| #endif
| #if HAVE_INTTYPES_H
| # include
| #else
| # if HAVE_STDINT_H
| # include
| # endif
| #endif
| #if HAVE_UNISTD_H
| # include
| #endif
| #include
configure:25866: result: no
configure:25870: checking Carbon/Carbon.h presence
configure:25880: gcc -E conftest.c
conftest.c:49:27: error: Carbon/Carbon.h: No such file or directory
configure:25886: $? = 1
configure: failed program was:
| /* confdefs.h. */
|
| #define PACKAGE_NAME ""
| #define PACKAGE_TARNAME ""
| #define PACKAGE_VERSION ""
| #define PACKAGE_STRING ""
| #define PACKAGE_BUGREPORT ""
| #define PACKAGE "arts"
| #define VERSION "1.5.1"
| #ifdef __cplusplus
| void exit (int);
| #endif
| #define KDELIBSUFF "64"
| #define STDC_HEADERS 1
| #define HAVE_SYS_TYPES_H 1
| #define HAVE_SYS_STAT_H 1
| #define HAVE_STDLIB_H 1
| #define HAVE_STRING_H 1
| #define HAVE_MEMORY_H 1
| #define HAVE_STRINGS_H 1
| #define HAVE_INTTYPES_H 1
| #define HAVE_STDINT_H 1
| #define HAVE_UNISTD_H 1
| #define HAVE_DLFCN_H 1
| #define LTDL_SHLIBPATH_VAR "LD_LIBRARY_PATH"
| #define LTDL_SYSSEARCHPATH "/lib64:/usr/lib64"
| #define LTDL_OBJDIR ".libs/"
| #define HAVE_PRELOADED_SYMBOLS 1
| #define HAVE_LIBDL 1
| #define HAVE_DLERROR 1
| #define HAVE_MALLOC_H 1
| #define HAVE_MEMORY_H 1
| #define HAVE_STDLIB_H 1
| #define HAVE_STDIO_H 1
| #define HAVE_CTYPE_H 1
| #define HAVE_DLFCN_H 1
| #define HAVE_STRING_H 1
| #define HAVE_STRCHR 1
| #define HAVE_STRRCHR 1
| #define HAVE_MEMCPY 1
| #define HAVE_STRCMP 1
| #define HAVE_CRYPT 1
| #define kde_socklen_t int
| #define ksize_t int
| #define HAVE_SYS_TYPES_H 1
| #define HAVE_STDINT_H 1
| #define HAVE_SYS_BITYPES_H 1
| /* end confdefs.h. */
| #include
configure:25906: result: no
configure:25941: checking for Carbon/Carbon.h
configure:25948: result: no
configure:25973: checking CoreAudio/CoreAudio.h usability
configure:25985: gcc -c -std=iso9899:1990 -W -Wall -Wchar-subscripts -Wshadow -Wpointer-arith -Wmissing-prototypes -Wwrite-strings -D_XOPEN_SOURCE=500 -D_BSD_SOURCE -g -O2 -fno-schedule-insns -fno-inline -Wformat-security -Wmissing-format-attribute conftest.c >&5
conftest.c:83:33: error: CoreAudio/CoreAudio.h: No such file or directory
configure:25991: $? = 1
configure: failed program was:
| /* confdefs.h. */
|
| #define PACKAGE_NAME ""
| #define PACKAGE_TARNAME ""
| #define PACKAGE_VERSION ""
| #define PACKAGE_STRING ""
| #define PACKAGE_BUGREPORT ""
| #define PACKAGE "arts"
| #define VERSION "1.5.1"
| #ifdef __cplusplus
| void exit (int);
| #endif
| #define KDELIBSUFF "64"
| #define STDC_HEADERS 1
| #define HAVE_SYS_TYPES_H 1
| #define HAVE_SYS_STAT_H 1
| #define HAVE_STDLIB_H 1
| #define HAVE_STRING_H 1
| #define HAVE_MEMORY_H 1
| #define HAVE_STRINGS_H 1
| #define HAVE_INTTYPES_H 1
| #define HAVE_STDINT_H 1
| #define HAVE_UNISTD_H 1
| #define HAVE_DLFCN_H 1
| #define LTDL_SHLIBPATH_VAR "LD_LIBRARY_PATH"
| #define LTDL_SYSSEARCHPATH "/lib64:/usr/lib64"
| #define LTDL_OBJDIR ".libs/"
| #define HAVE_PRELOADED_SYMBOLS 1
| #define HAVE_LIBDL 1
| #define HAVE_DLERROR 1
| #define HAVE_MALLOC_H 1
| #define HAVE_MEMORY_H 1
| #define HAVE_STDLIB_H 1
| #define HAVE_STDIO_H 1
| #define HAVE_CTYPE_H 1
| #define HAVE_DLFCN_H 1
| #define HAVE_STRING_H 1
| #define HAVE_STRCHR 1
| #define HAVE_STRRCHR 1
| #define HAVE_MEMCPY 1
| #define HAVE_STRCMP 1
| #define HAVE_CRYPT 1
| #define kde_socklen_t int
| #define ksize_t int
| #define HAVE_SYS_TYPES_H 1
| #define HAVE_STDINT_H 1
| #define HAVE_SYS_BITYPES_H 1
| /* end confdefs.h. */
| #include
| #if HAVE_SYS_TYPES_H
| # include
| #endif
| #if HAVE_SYS_STAT_H
| # include
| #endif
| #if STDC_HEADERS
| # include
| # include
| #else
| # if HAVE_STDLIB_H
| # include
| # endif
| #endif
| #if HAVE_STRING_H
| # if !STDC_HEADERS && HAVE_MEMORY_H
| # include
| # endif
| # include
| #endif
| #if HAVE_STRINGS_H
| # include
| #endif
| #if HAVE_INTTYPES_H
| # include
| #else
| # if HAVE_STDINT_H
| # include
| # endif
| #endif
| #if HAVE_UNISTD_H
| # include
| #endif
| #include
configure:26014: result: no
configure:26018: checking CoreAudio/CoreAudio.h presence
configure:26028: gcc -E conftest.c
conftest.c:49:33: error: CoreAudio/CoreAudio.h: No such file or directory
configure:26034: $? = 1
configure: failed program was:
| /* confdefs.h. */
|
| #define PACKAGE_NAME ""
| #define PACKAGE_TARNAME ""
| #define PACKAGE_VERSION ""
| #define PACKAGE_STRING ""
| #define PACKAGE_BUGREPORT ""
| #define PACKAGE "arts"
| #define VERSION "1.5.1"
| #ifdef __cplusplus
| void exit (int);
| #endif
| #define KDELIBSUFF "64"
| #define STDC_HEADERS 1
| #define HAVE_SYS_TYPES_H 1
| #define HAVE_SYS_STAT_H 1
| #define HAVE_STDLIB_H 1
| #define HAVE_STRING_H 1
| #define HAVE_MEMORY_H 1
| #define HAVE_STRINGS_H 1
| #define HAVE_INTTYPES_H 1
| #define HAVE_STDINT_H 1
| #define HAVE_UNISTD_H 1
| #define HAVE_DLFCN_H 1
| #define LTDL_SHLIBPATH_VAR "LD_LIBRARY_PATH"
| #define LTDL_SYSSEARCHPATH "/lib64:/usr/lib64"
| #define LTDL_OBJDIR ".libs/"
| #define HAVE_PRELOADED_SYMBOLS 1
| #define HAVE_LIBDL 1
| #define HAVE_DLERROR 1
| #define HAVE_MALLOC_H 1
| #define HAVE_MEMORY_H 1
| #define HAVE_STDLIB_H 1
| #define HAVE_STDIO_H 1
| #define HAVE_CTYPE_H 1
| #define HAVE_DLFCN_H 1
| #define HAVE_STRING_H 1
| #define HAVE_STRCHR 1
| #define HAVE_STRRCHR 1
| #define HAVE_MEMCPY 1
| #define HAVE_STRCMP 1
| #define HAVE_CRYPT 1
| #define kde_socklen_t int
| #define ksize_t int
| #define HAVE_SYS_TYPES_H 1
| #define HAVE_STDINT_H 1
| #define HAVE_SYS_BITYPES_H 1
| /* end confdefs.h. */
| #include
configure:26054: result: no
configure:26089: checking for CoreAudio/CoreAudio.h
configure:26096: result: no
configure:26114: checking if res_init needs -lresolv
configure:26141: gcc -o conftest -std=iso9899:1990 -W -Wall -Wchar-subscripts -Wshadow -Wpointer-arith -Wmissing-prototypes -Wwrite-strings -D_XOPEN_SOURCE=500 -D_BSD_SOURCE -g -O2 -fno-schedule-insns -fno-inline -Wformat-security -Wmissing-format-attribute conftest.c -lresolv >&5
configure:26147: $? = 0
configure:26151: test -z
|| test ! -s conftest.err
configure:26154: $? = 0
configure:26157: test -s conftest
configure:26160: $? = 0
configure:26164: result: yes
configure:26186: checking for res_init
configure:26234: g++ -c -ansi -D_XOPEN_SOURCE=500 -D_BSD_SOURCE -Wcast-align -Wconversion -Wchar-subscripts -Wall -W -Wpointer-arith -pipe -march=athlon-xp -m3dnow conftest.cc >&5
conftest.cc:1: error: CPU you selected does not support x86-64 instruction set
conftest.cc:1: error: CPU you selected does not support x86-64 instruction set
configure:26240: $? = 1
configure: failed program was:
| /* confdefs.h. */
|
| #define PACKAGE_NAME ""
| #define PACKAGE_TARNAME ""
| #define PACKAGE_VERSION ""
| #define PACKAGE_STRING ""
| #define PACKAGE_BUGREPORT ""
| #define PACKAGE "arts"
| #define VERSION "1.5.1"
| #ifdef __cplusplus
| void exit (int);
| #endif
| #define KDELIBSUFF "64"
| #define STDC_HEADERS 1
| #define HAVE_SYS_TYPES_H 1
| #define HAVE_SYS_STAT_H 1
| #define HAVE_STDLIB_H 1
| #define HAVE_STRING_H 1
| #define HAVE_MEMORY_H 1
| #define HAVE_STRINGS_H 1
| #define HAVE_INTTYPES_H 1
| #define HAVE_STDINT_H 1
| #define HAVE_UNISTD_H 1
| #define HAVE_DLFCN_H 1
| #define LTDL_SHLIBPATH_VAR "LD_LIBRARY_PATH"
| #define LTDL_SYSSEARCHPATH "/lib64:/usr/lib64"
| #define LTDL_OBJDIR ".libs/"
| #define HAVE_PRELOADED_SYMBOLS 1
| #define HAVE_LIBDL 1
| #define HAVE_DLERROR 1
| #define HAVE_MALLOC_H 1
| #define HAVE_MEMORY_H 1
| #define HAVE_STDLIB_H 1
| #define HAVE_STDIO_H 1
| #define HAVE_CTYPE_H 1
| #define HAVE_DLFCN_H 1
| #define HAVE_STRING_H 1
| #define HAVE_STRCHR 1
| #define HAVE_STRRCHR 1
| #define HAVE_MEMCPY 1
| #define HAVE_STRCMP 1
| #define HAVE_CRYPT 1
| #define kde_socklen_t int
| #define ksize_t int
| #define HAVE_SYS_TYPES_H 1
| #define HAVE_STDINT_H 1
| #define HAVE_SYS_BITYPES_H 1
| #define HAVE_RES_INIT 1
| /* end confdefs.h. */
|
|
| #include
| #include
| #include
| #include
|
|
| int
| main ()
| {
|
| res_init()
|
| ;
| return 0;
| }
configure:26275: result: no
configure:26278: checking if res_init needs custom prototype
configure:26339: rm -rf SunWS_cache; g++ -o conftest -ansi -D_XOPEN_SOURCE=500 -D_BSD_SOURCE -Wcast-align -Wconversion -Wchar-subscripts -Wall -W -Wpointer-arith -pipe -march=athlon-xp -m3dnow conftest.cc 1>&5
conftest.cc:1: error: CPU you selected does not support x86-64 instruction set
conftest.cc:1: error: CPU you selected does not support x86-64 instruction set
configure:26345: $? = 1
configure: failed program was:
| /* confdefs.h. */
|
| #define PACKAGE_NAME ""
| #define PACKAGE_TARNAME ""
| #define PACKAGE_VERSION ""
| #define PACKAGE_STRING ""
| #define PACKAGE_BUGREPORT ""
| #define PACKAGE "arts"
| #define VERSION "1.5.1"
| #ifdef __cplusplus
| void exit (int);
| #endif
| #define KDELIBSUFF "64"
| #define STDC_HEADERS 1
| #define HAVE_SYS_TYPES_H 1
| #define HAVE_SYS_STAT_H 1
| #define HAVE_STDLIB_H 1
| #define HAVE_STRING_H 1
| #define HAVE_MEMORY_H 1
| #define HAVE_STRINGS_H 1
| #define HAVE_INTTYPES_H 1
| #define HAVE_STDINT_H 1
| #define HAVE_UNISTD_H 1
| #define HAVE_DLFCN_H 1
| #define LTDL_SHLIBPATH_VAR "LD_LIBRARY_PATH"
| #define LTDL_SYSSEARCHPATH "/lib64:/usr/lib64"
| #define LTDL_OBJDIR ".libs/"
| #define HAVE_PRELOADED_SYMBOLS 1
| #define HAVE_LIBDL 1
| #define HAVE_DLERROR 1
| #define HAVE_MALLOC_H 1
| #define HAVE_MEMORY_H 1
| #define HAVE_STDLIB_H 1
| #define HAVE_STDIO_H 1
| #define HAVE_CTYPE_H 1
| #define HAVE_DLFCN_H 1
| #define HAVE_STRING_H 1
| #define HAVE_STRCHR 1
| #define HAVE_STRRCHR 1
| #define HAVE_MEMCPY 1
| #define HAVE_STRCMP 1
| #define HAVE_CRYPT 1
| #define kde_socklen_t int
| #define ksize_t int
| #define HAVE_SYS_TYPES_H 1
| #define HAVE_STDINT_H 1
| #define HAVE_SYS_BITYPES_H 1
| #define HAVE_RES_INIT 1
| /* end confdefs.h. */
|
|
| #include
| #include
| #include
| #include
|
|
| extern "C" int res_init(void);
|
| int
| main ()
| {
|
| res_init()
|
| ;
| return 0;
| }
configure:26382: result: res_init unavailable
configure:26410: checking for killpg in -lucb
configure:26440: gcc -o conftest -std=iso9899:1990 -W -Wall -Wchar-subscripts -Wshadow -Wpointer-arith -Wmissing-prototypes -Wwrite-strings -D_XOPEN_SOURCE=500 -D_BSD_SOURCE -g -O2 -fno-schedule-insns -fno-inline -Wformat-security -Wmissing-format-attribute conftest.c -lucb >&5
/usr/lib64/gcc/x86_64-suse-linux/4.0.2/../../../../x86_64-suse-linux/bin/ld: cannot find -lucb
collect2: ld returned 1 exit status
configure:26446: $? = 1
configure: failed program was:
| /* confdefs.h. */
|
| #define PACKAGE_NAME ""
| #define PACKAGE_TARNAME ""
| #define PACKAGE_VERSION ""
| #define PACKAGE_STRING ""
| #define PACKAGE_BUGREPORT ""
| #define PACKAGE "arts"
| #define VERSION "1.5.1"
| #ifdef __cplusplus
| void exit (int);
| #endif
| #define KDELIBSUFF "64"
| #define STDC_HEADERS 1
| #define HAVE_SYS_TYPES_H 1
| #define HAVE_SYS_STAT_H 1
| #define HAVE_STDLIB_H 1
| #define HAVE_STRING_H 1
| #define HAVE_MEMORY_H 1
| #define HAVE_STRINGS_H 1
| #define HAVE_INTTYPES_H 1
| #define HAVE_STDINT_H 1
| #define HAVE_UNISTD_H 1
| #define HAVE_DLFCN_H 1
| #define LTDL_SHLIBPATH_VAR "LD_LIBRARY_PATH"
| #define LTDL_SYSSEARCHPATH "/lib64:/usr/lib64"
| #define LTDL_OBJDIR ".libs/"
| #define HAVE_PRELOADED_SYMBOLS 1
| #define HAVE_LIBDL 1
| #define HAVE_DLERROR 1
| #define HAVE_MALLOC_H 1
| #define HAVE_MEMORY_H 1
| #define HAVE_STDLIB_H 1
| #define HAVE_STDIO_H 1
| #define HAVE_CTYPE_H 1
| #define HAVE_DLFCN_H 1
| #define HAVE_STRING_H 1
| #define HAVE_STRCHR 1
| #define HAVE_STRRCHR 1
| #define HAVE_MEMCPY 1
| #define HAVE_STRCMP 1
| #define HAVE_CRYPT 1
| #define kde_socklen_t int
| #define ksize_t int
| #define HAVE_SYS_TYPES_H 1
| #define HAVE_STDINT_H 1
| #define HAVE_SYS_BITYPES_H 1
| #define HAVE_RES_INIT 1
| /* end confdefs.h. */
|
| /* Override any gcc2 internal prototype to avoid an error. */
| #ifdef __cplusplus
| extern "C"
| #endif
| /* We use char because int might match the return type of a gcc2
| builtin and then its argument prototype would still apply. */
| char killpg ();
| int
| main ()
| {
| killpg ();
| ;
| return 0;
| }
configure:26472: result: no
configure:26555: checking for int
configure:26579: gcc -c -std=iso9899:1990 -W -Wall -Wchar-subscripts -Wshadow -Wpointer-arith -Wmissing-prototypes -Wwrite-strings -D_XOPEN_SOURCE=500 -D_BSD_SOURCE -g -O2 -fno-schedule-insns -fno-inline -Wformat-security -Wmissing-format-attribute conftest.c >&5
configure:26585: $? = 0
configure:26589: test -z
|| test ! -s conftest.err
configure:26592: $? = 0
configure:26595: test -s conftest.o
configure:26598: $? = 0
configure:26609: result: yes
configure:26612: checking size of int
configure:26931: gcc -o conftest -std=iso9899:1990 -W -Wall -Wchar-subscripts -Wshadow -Wpointer-arith -Wmissing-prototypes -Wwrite-strings -D_XOPEN_SOURCE=500 -D_BSD_SOURCE -g -O2 -fno-schedule-insns -fno-inline -Wformat-security -Wmissing-format-attribute conftest.c >&5
conftest.c:84: warning: no previous prototype for 'longval'
conftest.c:85: warning: no previous prototype for 'ulongval'
configure:26934: $? = 0
configure:26936: ./conftest
configure:26939: $? = 0
configure:26962: result: 4
configure:26968: checking for short
configure:26992: gcc -c -std=iso9899:1990 -W -Wall -Wchar-subscripts -Wshadow -Wpointer-arith -Wmissing-prototypes -Wwrite-strings -D_XOPEN_SOURCE=500 -D_BSD_SOURCE -g -O2 -fno-schedule-insns -fno-inline -Wformat-security -Wmissing-format-attribute conftest.c >&5
configure:26998: $? = 0
configure:27002: test -z
|| test ! -s conftest.err
configure:27005: $? = 0
configure:27008: test -s conftest.o
configure:27011: $? = 0
configure:27022: result: yes
configure:27025: checking size of short
configure:27344: gcc -o conftest -std=iso9899:1990 -W -Wall -Wchar-subscripts -Wshadow -Wpointer-arith -Wmissing-prototypes -Wwrite-strings -D_XOPEN_SOURCE=500 -D_BSD_SOURCE -g -O2 -fno-schedule-insns -fno-inline -Wformat-security -Wmissing-format-attribute conftest.c >&5
conftest.c:85: warning: no previous prototype for 'longval'
conftest.c:86: warning: no previous prototype for 'ulongval'
configure:27347: $? = 0
configure:27349: ./conftest
configure:27352: $? = 0
configure:27375: result: 2
configure:27381: checking for long
configure:27405: gcc -c -std=iso9899:1990 -W -Wall -Wchar-subscripts -Wshadow -Wpointer-arith -Wmissing-prototypes -Wwrite-strings -D_XOPEN_SOURCE=500 -D_BSD_SOURCE -g -O2 -fno-schedule-insns -fno-inline -Wformat-security -Wmissing-format-attribute conftest.c >&5
configure:27411: $? = 0
configure:27415: test -z
|| test ! -s conftest.err
configure:27418: $? = 0
configure:27421: test -s conftest.o
configure:27424: $? = 0
configure:27435: result: yes
configure:27438: checking size of long
configure:27757: gcc -o conftest -std=iso9899:1990 -W -Wall -Wchar-subscripts -Wshadow -Wpointer-arith -Wmissing-prototypes -Wwrite-strings -D_XOPEN_SOURCE=500 -D_BSD_SOURCE -g -O2 -fno-schedule-insns -fno-inline -Wformat-security -Wmissing-format-attribute conftest.c >&5
conftest.c:86: warning: no previous prototype for 'longval'
conftest.c:87: warning: no previous prototype for 'ulongval'
configure:27760: $? = 0
configure:27762: ./conftest
configure:27765: $? = 0
configure:27788: result: 8
configure:27794: checking for char *
configure:27818: gcc -c -std=iso9899:1990 -W -Wall -Wchar-subscripts -Wshadow -Wpointer-arith -Wmissing-prototypes -Wwrite-strings -D_XOPEN_SOURCE=500 -D_BSD_SOURCE -g -O2 -fno-schedule-insns -fno-inline -Wformat-security -Wmissing-format-attribute conftest.c >&5
configure:27824: $? = 0
configure:27828: test -z
|| test ! -s conftest.err
configure:27831: $? = 0
configure:27834: test -s conftest.o
configure:27837: $? = 0
configure:27848: result: yes
configure:27851: checking size of char *
configure:28170: gcc -o conftest -std=iso9899:1990 -W -Wall -Wchar-subscripts -Wshadow -Wpointer-arith -Wmissing-prototypes -Wwrite-strings -D_XOPEN_SOURCE=500 -D_BSD_SOURCE -g -O2 -fno-schedule-insns -fno-inline -Wformat-security -Wmissing-format-attribute conftest.c >&5
conftest.c:87: warning: no previous prototype for 'longval'
conftest.c:88: warning: no previous prototype for 'ulongval'
configure:28173: $? = 0
configure:28175: ./conftest
configure:28178: $? = 0
configure:28201: result: 8
configure:28209: checking for dlopen in -ldl
configure:28271: result: yes
configure:28281: checking for shl_unload in -ldld
configure:28311: gcc -o conftest -std=iso9899:1990 -W -Wall -Wchar-subscripts -Wshadow -Wpointer-arith -Wmissing-prototypes -Wwrite-strings -D_XOPEN_SOURCE=500 -D_BSD_SOURCE -g -O2 -fno-schedule-insns -fno-inline -Wformat-security -Wmissing-format-attribute conftest.c -ldld >&5
/usr/lib64/gcc/x86_64-suse-linux/4.0.2/../../../../x86_64-suse-linux/bin/ld: cannot find -ldld
collect2: ld returned 1 exit status
configure:28317: $? = 1
configure: failed program was:
| /* confdefs.h. */
|
| #define PACKAGE_NAME ""
| #define PACKAGE_TARNAME ""
| #define PACKAGE_VERSION ""
| #define PACKAGE_STRING ""
| #define PACKAGE_BUGREPORT ""
| #define PACKAGE "arts"
| #define VERSION "1.5.1"
| #ifdef __cplusplus
| void exit (int);
| #endif
| #define KDELIBSUFF "64"
| #define STDC_HEADERS 1
| #define HAVE_SYS_TYPES_H 1
| #define HAVE_SYS_STAT_H 1
| #define HAVE_STDLIB_H 1
| #define HAVE_STRING_H 1
| #define HAVE_MEMORY_H 1
| #define HAVE_STRINGS_H 1
| #define HAVE_INTTYPES_H 1
| #define HAVE_STDINT_H 1
| #define HAVE_UNISTD_H 1
| #define HAVE_DLFCN_H 1
| #define LTDL_SHLIBPATH_VAR "LD_LIBRARY_PATH"
| #define LTDL_SYSSEARCHPATH "/lib64:/usr/lib64"
| #define LTDL_OBJDIR ".libs/"
| #define HAVE_PRELOADED_SYMBOLS 1
| #define HAVE_LIBDL 1
| #define HAVE_DLERROR 1
| #define HAVE_MALLOC_H 1
| #define HAVE_MEMORY_H 1
| #define HAVE_STDLIB_H 1
| #define HAVE_STDIO_H 1
| #define HAVE_CTYPE_H 1
| #define HAVE_DLFCN_H 1
| #define HAVE_STRING_H 1
| #define HAVE_STRCHR 1
| #define HAVE_STRRCHR 1
| #define HAVE_MEMCPY 1
| #define HAVE_STRCMP 1
| #define HAVE_CRYPT 1
| #define kde_socklen_t int
| #define ksize_t int
| #define HAVE_SYS_TYPES_H 1
| #define HAVE_STDINT_H 1
| #define HAVE_SYS_BITYPES_H 1
| #define HAVE_RES_INIT 1
| #define SIZEOF_INT 4
| #define SIZEOF_SHORT 2
| #define SIZEOF_LONG 8
| #define SIZEOF_CHAR_P 8
| /* end confdefs.h. */
|
| /* Override any gcc2 internal prototype to avoid an error. */
| #ifdef __cplusplus
| extern "C"
| #endif
| /* We use char because int might match the return type of a gcc2
| builtin and then its argument prototype would still apply. */
| char shl_unload ();
| int
| main ()
| {
| shl_unload ();
| ;
| return 0;
| }
configure:28343: result: no
configure:28358: checking for size_t
configure:28382: gcc -c -std=iso9899:1990 -W -Wall -Wchar-subscripts -Wshadow -Wpointer-arith -Wmissing-prototypes -Wwrite-strings -D_XOPEN_SOURCE=500 -D_BSD_SOURCE -g -O2 -fno-schedule-insns -fno-inline -Wformat-security -Wmissing-format-attribute conftest.c >&5
configure:28388: $? = 0
configure:28392: test -z
|| test ! -s conftest.err
configure:28395: $? = 0
configure:28398: test -s conftest.o
configure:28401: $? = 0
configure:28412: result: yes
configure:28415: checking size of size_t
configure:28734: gcc -o conftest -std=iso9899:1990 -W -Wall -Wchar-subscripts -Wshadow -Wpointer-arith -Wmissing-prototypes -Wwrite-strings -D_XOPEN_SOURCE=500 -D_BSD_SOURCE -g -O2 -fno-schedule-insns -fno-inline -Wformat-security -Wmissing-format-attribute conftest.c >&5
conftest.c:88: warning: no previous prototype for 'longval'
conftest.c:89: warning: no previous prototype for 'ulongval'
configure:28737: $? = 0
configure:28739: ./conftest
configure:28742: $? = 0
configure:28765: result: 8
configure:28772: checking for unsigned long
configure:28796: gcc -c -std=iso9899:1990 -W -Wall -Wchar-subscripts -Wshadow -Wpointer-arith -Wmissing-prototypes -Wwrite-strings -D_XOPEN_SOURCE=500 -D_BSD_SOURCE -g -O2 -fno-schedule-insns -fno-inline -Wformat-security -Wmissing-format-attribute conftest.c >&5
configure:28802: $? = 0
configure:28806: test -z
|| test ! -s conftest.err
configure:28809: $? = 0
configure:28812: test -s conftest.o
configure:28815: $? = 0
configure:28826: result: yes
configure:28829: checking size of unsigned long
configure:29148: gcc -o conftest -std=iso9899:1990 -W -Wall -Wchar-subscripts -Wshadow -Wpointer-arith -Wmissing-prototypes -Wwrite-strings -D_XOPEN_SOURCE=500 -D_BSD_SOURCE -g -O2 -fno-schedule-insns -fno-inline -Wformat-security -Wmissing-format-attribute conftest.c >&5
conftest.c:89: warning: no previous prototype for 'longval'
conftest.c:90: warning: no previous prototype for 'ulongval'
configure:29151: $? = 0
configure:29153: ./conftest
configure:29156: $? = 0
configure:29179: result: 8
configure:29187: checking sizeof size_t == sizeof unsigned long
configure:29209: gcc -c -std=iso9899:1990 -W -Wall -Wchar-subscripts -Wshadow -Wpointer-arith -Wmissing-prototypes -Wwrite-strings -D_XOPEN_SOURCE=500 -D_BSD_SOURCE -g -O2 -fno-schedule-insns -fno-inline -Wformat-security -Wmissing-format-attribute conftest.c >&5
configure:29215: $? = 0
configure:29219: test -z
|| test ! -s conftest.err
configure:29222: $? = 0
configure:29225: test -s conftest.o
configure:29228: $? = 0
configure:29230: result: yes
configure:29253: checking for PIE support
configure:29291: rm -rf SunWS_cache; g++ -o conftest -ansi -D_XOPEN_SOURCE=500 -D_BSD_SOURCE -Wcast-align -Wconversion -Wchar-subscripts -Wall -W -Wpointer-arith -pipe -march=athlon-xp -m3dnow -fpie -pie conftest.cc 1>&5
conftest.cc:1: error: CPU you selected does not support x86-64 instruction set
conftest.cc:1: error: CPU you selected does not support x86-64 instruction set
configure:29297: $? = 1
configure: failed program was:
| /* confdefs.h. */
|
| #define PACKAGE_NAME ""
| #define PACKAGE_TARNAME ""
| #define PACKAGE_VERSION ""
| #define PACKAGE_STRING ""
| #define PACKAGE_BUGREPORT ""
| #define PACKAGE "arts"
| #define VERSION "1.5.1"
| #ifdef __cplusplus
| void exit (int);
| #endif
| #define KDELIBSUFF "64"
| #define STDC_HEADERS 1
| #define HAVE_SYS_TYPES_H 1
| #define HAVE_SYS_STAT_H 1
| #define HAVE_STDLIB_H 1
| #define HAVE_STRING_H 1
| #define HAVE_MEMORY_H 1
| #define HAVE_STRINGS_H 1
| #define HAVE_INTTYPES_H 1
| #define HAVE_STDINT_H 1
| #define HAVE_UNISTD_H 1
| #define HAVE_DLFCN_H 1
| #define LTDL_SHLIBPATH_VAR "LD_LIBRARY_PATH"
| #define LTDL_SYSSEARCHPATH "/lib64:/usr/lib64"
| #define LTDL_OBJDIR ".libs/"
| #define HAVE_PRELOADED_SYMBOLS 1
| #define HAVE_LIBDL 1
| #define HAVE_DLERROR 1
| #define HAVE_MALLOC_H 1
| #define HAVE_MEMORY_H 1
| #define HAVE_STDLIB_H 1
| #define HAVE_STDIO_H 1
| #define HAVE_CTYPE_H 1
| #define HAVE_DLFCN_H 1
| #define HAVE_STRING_H 1
| #define HAVE_STRCHR 1
| #define HAVE_STRRCHR 1
| #define HAVE_MEMCPY 1
| #define HAVE_STRCMP 1
| #define HAVE_CRYPT 1
| #define kde_socklen_t int
| #define ksize_t int
| #define HAVE_SYS_TYPES_H 1
| #define HAVE_STDINT_H 1
| #define HAVE_SYS_BITYPES_H 1
| #define HAVE_RES_INIT 1
| #define SIZEOF_INT 4
| #define SIZEOF_SHORT 2
| #define SIZEOF_LONG 8
| #define SIZEOF_CHAR_P 8
| #define SIZEOF_SIZE_T 8
| #define SIZEOF_UNSIGNED_LONG 8
| /* end confdefs.h. */
| int foo;
| int
| main ()
| {
|
| ;
| return 0;
| }
configure:29332: result: no
configure:29335: checking if enabling -pie/fpie support
configure:29350: result: no
configure:29380: checking crt_externs.h usability
configure:29392: gcc -c -std=iso9899:1990 -W -Wall -Wchar-subscripts -Wshadow -Wpointer-arith -Wmissing-prototypes -Wwrite-strings -D_XOPEN_SOURCE=500 -D_BSD_SOURCE -g -O2 -fno-schedule-insns -fno-inline -Wformat-security -Wmissing-format-attribute conftest.c >&5
conftest.c:90:25: error: crt_externs.h: No such file or directory
configure:29398: $? = 1
configure: failed program was:
| /* confdefs.h. */
|
| #define PACKAGE_NAME ""
| #define PACKAGE_TARNAME ""
| #define PACKAGE_VERSION ""
| #define PACKAGE_STRING ""
| #define PACKAGE_BUGREPORT ""
| #define PACKAGE "arts"
| #define VERSION "1.5.1"
| #ifdef __cplusplus
| void exit (int);
| #endif
| #define KDELIBSUFF "64"
| #define STDC_HEADERS 1
| #define HAVE_SYS_TYPES_H 1
| #define HAVE_SYS_STAT_H 1
| #define HAVE_STDLIB_H 1
| #define HAVE_STRING_H 1
| #define HAVE_MEMORY_H 1
| #define HAVE_STRINGS_H 1
| #define HAVE_INTTYPES_H 1
| #define HAVE_STDINT_H 1
| #define HAVE_UNISTD_H 1
| #define HAVE_DLFCN_H 1
| #define LTDL_SHLIBPATH_VAR "LD_LIBRARY_PATH"
| #define LTDL_SYSSEARCHPATH "/lib64:/usr/lib64"
| #define LTDL_OBJDIR ".libs/"
| #define HAVE_PRELOADED_SYMBOLS 1
| #define HAVE_LIBDL 1
| #define HAVE_DLERROR 1
| #define HAVE_MALLOC_H 1
| #define HAVE_MEMORY_H 1
| #define HAVE_STDLIB_H 1
| #define HAVE_STDIO_H 1
| #define HAVE_CTYPE_H 1
| #define HAVE_DLFCN_H 1
| #define HAVE_STRING_H 1
| #define HAVE_STRCHR 1
| #define HAVE_STRRCHR 1
| #define HAVE_MEMCPY 1
| #define HAVE_STRCMP 1
| #define HAVE_CRYPT 1
| #define kde_socklen_t int
| #define ksize_t int
| #define HAVE_SYS_TYPES_H 1
| #define HAVE_STDINT_H 1
| #define HAVE_SYS_BITYPES_H 1
| #define HAVE_RES_INIT 1
| #define SIZEOF_INT 4
| #define SIZEOF_SHORT 2
| #define SIZEOF_LONG 8
| #define SIZEOF_CHAR_P 8
| #define SIZEOF_SIZE_T 8
| #define SIZEOF_UNSIGNED_LONG 8
| /* end confdefs.h. */
| #include
| #if HAVE_SYS_TYPES_H
| # include
| #endif
| #if HAVE_SYS_STAT_H
| # include
| #endif
| #if STDC_HEADERS
| # include
| # include
| #else
| # if HAVE_STDLIB_H
| # include
| # endif
| #endif
| #if HAVE_STRING_H
| # if !STDC_HEADERS && HAVE_MEMORY_H
| # include
| # endif
| # include
| #endif
| #if HAVE_STRINGS_H
| # include
| #endif
| #if HAVE_INTTYPES_H
| # include
| #else
| # if HAVE_STDINT_H
| # include
| # endif
| #endif
| #if HAVE_UNISTD_H
| # include
| #endif
| #include
configure:29421: result: no
configure:29425: checking crt_externs.h presence
configure:29435: gcc -E conftest.c
conftest.c:56:25: error: crt_externs.h: No such file or directory
configure:29441: $? = 1
configure: failed program was:
| /* confdefs.h. */
|
| #define PACKAGE_NAME ""
| #define PACKAGE_TARNAME ""
| #define PACKAGE_VERSION ""
| #define PACKAGE_STRING ""
| #define PACKAGE_BUGREPORT ""
| #define PACKAGE "arts"
| #define VERSION "1.5.1"
| #ifdef __cplusplus
| void exit (int);
| #endif
| #define KDELIBSUFF "64"
| #define STDC_HEADERS 1
| #define HAVE_SYS_TYPES_H 1
| #define HAVE_SYS_STAT_H 1
| #define HAVE_STDLIB_H 1
| #define HAVE_STRING_H 1
| #define HAVE_MEMORY_H 1
| #define HAVE_STRINGS_H 1
| #define HAVE_INTTYPES_H 1
| #define HAVE_STDINT_H 1
| #define HAVE_UNISTD_H 1
| #define HAVE_DLFCN_H 1
| #define LTDL_SHLIBPATH_VAR "LD_LIBRARY_PATH"
| #define LTDL_SYSSEARCHPATH "/lib64:/usr/lib64"
| #define LTDL_OBJDIR ".libs/"
| #define HAVE_PRELOADED_SYMBOLS 1
| #define HAVE_LIBDL 1
| #define HAVE_DLERROR 1
| #define HAVE_MALLOC_H 1
| #define HAVE_MEMORY_H 1
| #define HAVE_STDLIB_H 1
| #define HAVE_STDIO_H 1
| #define HAVE_CTYPE_H 1
| #define HAVE_DLFCN_H 1
| #define HAVE_STRING_H 1
| #define HAVE_STRCHR 1
| #define HAVE_STRRCHR 1
| #define HAVE_MEMCPY 1
| #define HAVE_STRCMP 1
| #define HAVE_CRYPT 1
| #define kde_socklen_t int
| #define ksize_t int
| #define HAVE_SYS_TYPES_H 1
| #define HAVE_STDINT_H 1
| #define HAVE_SYS_BITYPES_H 1
| #define HAVE_RES_INIT 1
| #define SIZEOF_INT 4
| #define SIZEOF_SHORT 2
| #define SIZEOF_LONG 8
| #define SIZEOF_CHAR_P 8
| #define SIZEOF_SIZE_T 8
| #define SIZEOF_UNSIGNED_LONG 8
| /* end confdefs.h. */
| #include
configure:29461: result: no
configure:29496: checking for crt_externs.h
configure:29503: result: no
configure:29516: checking for _NSGetEnviron
configure:29573: gcc -o conftest -std=iso9899:1990 -W -Wall -Wchar-subscripts -Wshadow -Wpointer-arith -Wmissing-prototypes -Wwrite-strings -D_XOPEN_SOURCE=500 -D_BSD_SOURCE -g -O2 -fno-schedule-insns -fno-inline -Wformat-security -Wmissing-format-attribute conftest.c >&5
/tmp/ccO4b25o.o: In function `main':
/hd/sdb1/daten/kdesvn/kde35build/arts/conftest.c:95: undefined reference to `_NSGetEnviron'
/tmp/ccO4b25o.o.data+0x0): undefined reference to `_NSGetEnviron'
collect2: ld returned 1 exit status
configure:29579: $? = 1
configure: failed program was:
| /* confdefs.h. */
|
| #define PACKAGE_NAME ""
| #define PACKAGE_TARNAME ""
| #define PACKAGE_VERSION ""
| #define PACKAGE_STRING ""
| #define PACKAGE_BUGREPORT ""
| #define PACKAGE "arts"
| #define VERSION "1.5.1"
| #ifdef __cplusplus
| void exit (int);
| #endif
| #define KDELIBSUFF "64"
| #define STDC_HEADERS 1
| #define HAVE_SYS_TYPES_H 1
| #define HAVE_SYS_STAT_H 1
| #define HAVE_STDLIB_H 1
| #define HAVE_STRING_H 1
| #define HAVE_MEMORY_H 1
| #define HAVE_STRINGS_H 1
| #define HAVE_INTTYPES_H 1
| #define HAVE_STDINT_H 1
| #define HAVE_UNISTD_H 1
| #define HAVE_DLFCN_H 1
| #define LTDL_SHLIBPATH_VAR "LD_LIBRARY_PATH"
| #define LTDL_SYSSEARCHPATH "/lib64:/usr/lib64"
| #define LTDL_OBJDIR ".libs/"
| #define HAVE_PRELOADED_SYMBOLS 1
| #define HAVE_LIBDL 1
| #define HAVE_DLERROR 1
| #define HAVE_MALLOC_H 1
| #define HAVE_MEMORY_H 1
| #define HAVE_STDLIB_H 1
| #define HAVE_STDIO_H 1
| #define HAVE_CTYPE_H 1
| #define HAVE_DLFCN_H 1
| #define HAVE_STRING_H 1
| #define HAVE_STRCHR 1
| #define HAVE_STRRCHR 1
| #define HAVE_MEMCPY 1
| #define HAVE_STRCMP 1
| #define HAVE_CRYPT 1
| #define kde_socklen_t int
| #define ksize_t int
| #define HAVE_SYS_TYPES_H 1
| #define HAVE_STDINT_H 1
| #define HAVE_SYS_BITYPES_H 1
| #define HAVE_RES_INIT 1
| #define SIZEOF_INT 4
| #define SIZEOF_SHORT 2
| #define SIZEOF_LONG 8
| #define SIZEOF_CHAR_P 8
| #define SIZEOF_SIZE_T 8
| #define SIZEOF_UNSIGNED_LONG 8
| /* end confdefs.h. */
| /* Define _NSGetEnviron to an innocuous variant, in case declares _NSGetEnviron.
| For example, HP-UX 11i declares gettimeofday. */
| #define _NSGetEnviron innocuous__NSGetEnviron
|
| /* System header to define __stub macros and hopefully few prototypes,
| which can conflict with char _NSGetEnviron (); below.
| Prefer to if __STDC__ is defined, since
| exists even on freestanding compilers. */
|
| #ifdef __STDC__
| # include
| #else
| # include
| #endif
|
| #undef _NSGetEnviron
|
| /* Override any gcc2 internal prototype to avoid an error. */
| #ifdef __cplusplus
| extern "C"
| {
| #endif
| /* We use char because int might match the return type of a gcc2
| builtin and then its argument prototype would still apply. */
| char _NSGetEnviron ();
| /* The GNU C library defines this for functions which it implements
| to always fail with ENOSYS. Some functions are actually named
| something starting with __ and the normal name is an alias. */
| #if defined (__stub__NSGetEnviron) || defined (__stub____NSGetEnviron)
| choke me
| #else
| char (*f) () = _NSGetEnviron;
| #endif
| #ifdef __cplusplus
| }
| #endif
|
| int
| main ()
| {
| return f != _NSGetEnviron;
| ;
| return 0;
| }
configure:29604: result: no
configure:29626: checking for vsnprintf
configure:29683: gcc -o conftest -std=iso9899:1990 -W -Wall -Wchar-subscripts -Wshadow -Wpointer-arith -Wmissing-prototypes -Wwrite-strings -D_XOPEN_SOURCE=500 -D_BSD_SOURCE -g -O2 -fno-schedule-insns -fno-inline -Wformat-security -Wmissing-format-attribute conftest.c >&5
configure:29689: $? = 0
configure:29693: test -z
|| test ! -s conftest.err
configure:29696: $? = 0
configure:29699: test -s conftest
configure:29702: $? = 0
configure:29714: result: yes
configure:29626: checking for snprintf
configure:29683: gcc -o conftest -std=iso9899:1990 -W -Wall -Wchar-subscripts -Wshadow -Wpointer-arith -Wmissing-prototypes -Wwrite-strings -D_XOPEN_SOURCE=500 -D_BSD_SOURCE -g -O2 -fno-schedule-insns -fno-inline -Wformat-security -Wmissing-format-attribute conftest.c >&5
configure:29689: $? = 0
configure:29693: test -z
|| test ! -s conftest.err
configure:29696: $? = 0
configure:29699: test -s conftest
configure:29702: $? = 0
configure:29714: result: yes
configure:29815: checking if Qt compiles without flags
configure:29912: rm -rf SunWS_cache; g++ -o conftest -ansi -D_XOPEN_SOURCE=500 -D_BSD_SOURCE -Wcast-align -Wconversion -Wchar-subscripts -Wall -W -Wpointer-arith -pipe -march=athlon-xp -m3dnow -I conftest.cc -lXext -lX11 1>&5
/usr/lib64/gcc/x86_64-suse-linux/4.0.2/../../../../x86_64-suse-linux/bin/ld: cannot find -lXext
collect2: ld returned 1 exit status
configure:29915: $? = 1
configure: failed program was:
#include "confdefs.h"
#include
#include
#include
#include
#include
#if ! (QT_VERSION >= 0x030300 && QT_VERSION < 0x040000)
#error 1
#endif

int main() {
(void)QStyleFactory::create(QString::null);
QCursor c(Qt::WhatsThisCursor);
return 0;
}
configure:29948: result: no
configure:29957: checking grepping for visibility push/pop in headers
configure:30320: checking if C++ programs can be compiled
configure:30349: g++ -c -ansi -D_XOPEN_SOURCE=500 -D_BSD_SOURCE -Wcast-align -Wconversion -Wchar-subscripts -Wall -W -Wpointer-arith -pipe -march=athlon-xp -m3dnow conftest.cc >&5
conftest.cc:1: error: CPU you selected does not support x86-64 instruction set
conftest.cc:1: error: CPU you selected does not support x86-64 instruction set
configure:30355: $? = 1
configure: failed program was:
| /* confdefs.h. */
|
| #define PACKAGE_NAME ""
| #define PACKAGE_TARNAME ""
| #define PACKAGE_VERSION ""
| #define PACKAGE_STRING ""
| #define PACKAGE_BUGREPORT ""
| #define PACKAGE "arts"
| #define VERSION "1.5.1"
| #ifdef __cplusplus
| void exit (int);
| #endif
| #define KDELIBSUFF "64"
| #define STDC_HEADERS 1
| #define HAVE_SYS_TYPES_H 1
| #define HAVE_SYS_STAT_H 1
| #define HAVE_STDLIB_H 1
| #define HAVE_STRING_H 1
| #define HAVE_MEMORY_H 1
| #define HAVE_STRINGS_H 1
| #define HAVE_INTTYPES_H 1
| #define HAVE_STDINT_H 1
| #define HAVE_UNISTD_H 1
| #define HAVE_DLFCN_H 1
| #define LTDL_SHLIBPATH_VAR "LD_LIBRARY_PATH"
| #define LTDL_SYSSEARCHPATH "/lib64:/usr/lib64"
| #define LTDL_OBJDIR ".libs/"
| #define HAVE_PRELOADED_SYMBOLS 1
| #define HAVE_LIBDL 1
| #define HAVE_DLERROR 1
| #define HAVE_MALLOC_H 1
| #define HAVE_MEMORY_H 1
| #define HAVE_STDLIB_H 1
| #define HAVE_STDIO_H 1
| #define HAVE_CTYPE_H 1
| #define HAVE_DLFCN_H 1
| #define HAVE_STRING_H 1
| #define HAVE_STRCHR 1
| #define HAVE_STRRCHR 1
| #define HAVE_MEMCPY 1
| #define HAVE_STRCMP 1
| #define HAVE_CRYPT 1
| #define kde_socklen_t int
| #define ksize_t int
| #define HAVE_SYS_TYPES_H 1
| #define HAVE_STDINT_H 1
| #define HAVE_SYS_BITYPES_H 1
| #define HAVE_RES_INIT 1
| #define SIZEOF_INT 4
| #define SIZEOF_SHORT 2
| #define SIZEOF_LONG 8
| #define SIZEOF_CHAR_P 8
| #define SIZEOF_SIZE_T 8
| #define SIZEOF_UNSIGNED_LONG 8
| #define HAVE_VSNPRINTF 1
| #define HAVE_SNPRINTF 1
| /* end confdefs.h. */
|
| #include
| using namespace std;
|
| int
| main ()
| {
|
| string astring="Hallo Welt.";
| astring.erase(0, 6); // now astring is "Welt"
| return 0;
|
| ;
| return 0;
| }
configure:30382: result: no
configure:30395: error: Your Installation isn't able to compile simple C++ programs.
Check config.log for details - if you're using a Linux distribution you might miss
a package named similar to libstdc++-dev.

## ---------------- ##
## Cache variables. ##
## ---------------- ##

ac_cv_build=x86_64-unknown-linux-gnu
ac_cv_build_alias=x86_64-unknown-linux-gnu
ac_cv_c_compiler_gnu=yes
ac_cv_cxx_compiler_gnu=no
ac_cv_env_CC_set=
ac_cv_env_CC_value=
ac_cv_env_CFLAGS_set=
ac_cv_env_CFLAGS_value=
ac_cv_env_CPPFLAGS_set=
ac_cv_env_CPPFLAGS_value=
ac_cv_env_CPP_set=
ac_cv_env_CPP_value=
ac_cv_env_CXXCPP_set=
ac_cv_env_CXXCPP_value=
ac_cv_env_CXXFLAGS_set=set
ac_cv_env_CXXFLAGS_value='-pipe -march=athlon-xp -m3dnow'
ac_cv_env_CXX_set=
ac_cv_env_CXX_value=
ac_cv_env_F77_set=
ac_cv_env_F77_value=
ac_cv_env_FFLAGS_set=
ac_cv_env_FFLAGS_value=
ac_cv_env_LDFLAGS_set=
ac_cv_env_LDFLAGS_value=
ac_cv_env_build_alias_set=
ac_cv_env_build_alias_value=
ac_cv_env_host_alias_set=
ac_cv_env_host_alias_value=
ac_cv_env_target_alias_set=
ac_cv_env_target_alias_value=
ac_cv_exeext=
ac_cv_f77_compiler_gnu=no
ac_cv_func__NSGetEnviron=no
ac_cv_func_connect=yes
ac_cv_func_dlerror=yes
ac_cv_func_dlopen=no
ac_cv_func_inet_ntoa=yes
ac_cv_func_memcpy=yes
ac_cv_func_remove=yes
ac_cv_func_shl_load=no
ac_cv_func_shmat=yes
ac_cv_func_snprintf=yes
ac_cv_func_strchr=yes
ac_cv_func_strcmp=yes
ac_cv_func_strrchr=yes
ac_cv_func_vsnprintf=yes
ac_cv_have_dlfcn=yes
ac_cv_header_Carbon_Carbon_h=no
ac_cv_header_CoreAudio_CoreAudio_h=no
ac_cv_header_crt_externs_h=no
ac_cv_header_ctype_h=yes
ac_cv_header_dl_h=no
ac_cv_header_dld_h=no
ac_cv_header_dlfcn_h=yes
ac_cv_header_inttypes_h=yes
ac_cv_header_malloc_h=yes
ac_cv_header_memory_h=yes
ac_cv_header_stdc=yes
ac_cv_header_stdint_h=yes
ac_cv_header_stdio_h=yes
ac_cv_header_stdlib_h=yes
ac_cv_header_string_h=yes
ac_cv_header_strings_h=yes
ac_cv_header_sys_bitypes_h=yes
ac_cv_header_sys_stat_h=yes
ac_cv_header_sys_types_h=yes
ac_cv_header_unistd_h=yes
ac_cv_host=x86_64-unknown-linux-gnu
ac_cv_host_alias=x86_64-unknown-linux-gnu
ac_cv_lib_compat_main=no
ac_cv_lib_crypt_crypt=yes
ac_cv_lib_dl_dlopen=yes
ac_cv_lib_dld_dld_link=no
ac_cv_lib_dld_shl_load=no
ac_cv_lib_dld_shl_unload=no
ac_cv_lib_dnet_dnet_ntoa=no
ac_cv_lib_dnet_stub_dnet_ntoa=no
ac_cv_lib_poll_poll=no
ac_cv_lib_ucb_killpg=no
ac_cv_lib_util_main=yes
ac_cv_objext=o
ac_cv_path_install='/usr/bin/install -c'
ac_cv_prog_AWK=gawk
ac_cv_prog_CPP='gcc -E'
ac_cv_prog_CXXCPP='g++ -E'
ac_cv_prog_ac_ct_AR=ar
ac_cv_prog_ac_ct_CC=gcc
ac_cv_prog_ac_ct_CXX=g++
ac_cv_prog_ac_ct_RANLIB=ranlib
ac_cv_prog_ac_ct_STRIP=strip
ac_cv_prog_cc_g=yes
ac_cv_prog_cc_stdc=
ac_cv_prog_cxx_g=yes
ac_cv_prog_egrep='grep -E'
ac_cv_prog_f77_g=no
ac_cv_prog_make_make_set=yes
ac_cv_sizeof_char_p=8
ac_cv_sizeof_int=4
ac_cv_sizeof_long=8
ac_cv_sizeof_short=2
ac_cv_sizeof_size_t=8
ac_cv_sizeof_unsigned_long=8
ac_cv_sys_global_symbol_pipe='sed -n -e '\''s/^.* \([ABCDGISTW]\) *\(\)\([_A-Za-z][_A-Za-z0-9]*\)$/\1 \2\3 \3/p'\'''
ac_cv_sys_symbol_underscore=no
ac_cv_target=x86_64-unknown-linux-gnu
ac_cv_target_alias=x86_64-unknown-linux-gnu
ac_cv_type_char_p=yes
ac_cv_type_int=yes
ac_cv_type_long=yes
ac_cv_type_short=yes
ac_cv_type_size_t=yes
ac_cv_type_unsigned_long=yes
am_cv_CC_dependencies_compiler_type=gcc3
am_cv_CXX_dependencies_compiler_type=gcc3
kde_cv_func_res_init=no
kde_cv_func_strlcat=no
kde_cv_func_strlcpy=no
kde_cv_prog_cc_Wmissing_format_attribute=yes
kde_cv_proto_res_init='res_init unavailable'
kde_cv_proto_strlcat='yes - in libkdefakes'
kde_cv_proto_strlcpy='yes - in libkdefakes'
kde_cv_qt_direct=no
kde_cv_socklen_t=no
kde_cv_socklen_t_equiv=int
kde_cv_stl_works=no
kde_cv_val_pie_support=no
libltdl_cv_objdir=.libs
libltdl_cv_preloaded_symbols=yes
libltdl_cv_shlibext=
libltdl_cv_shlibpath_var=LD_LIBRARY_PATH
libltdl_cv_sys_dlopen_deplibs=yes
libltdl_cv_sys_search_path='/lib64 /usr/lib64'
lt_cv_deplibs_check_method=pass_all
lt_cv_dlopen=dlopen
lt_cv_dlopen_libs=-ldl
lt_cv_dlopen_self=yes
lt_cv_dlopen_self_static=yes
lt_cv_file_magic_cmd='$MAGIC_CMD'
lt_cv_file_magic_test_file='/lib/libc.so.6 /lib/libc-2.3.5.so'
lt_cv_ld_reload_flag=-r
lt_cv_objdir=.libs
lt_cv_path_LD=/usr/x86_64-suse-linux/bin/ld
lt_cv_path_LDCXX=
lt_cv_path_NM='/usr/bin/nm -B'
lt_cv_path_SED=/bin/sed
lt_cv_prog_compiler_c_o=yes
lt_cv_prog_compiler_c_o_CXX=no
lt_cv_prog_compiler_rtti_exceptions=no
lt_cv_prog_gnu_ld=yes
lt_cv_prog_gnu_ldcxx=
lt_cv_sys_global_symbol_pipe='sed -n -e '\''s/^.*[ ]\([ABCDGISTW][ABCDGISTW]*\)[ ][ ]*\(\)\([_A-Za-z][_A-Za-z0-9]*\)$/\1 \2\3 \3/p'\'''
lt_cv_sys_global_symbol_to_c_name_address='sed -n -e '\''s/^: \([^ ]*\) $/ {\"\1\", (lt_ptr) 0},/p'\'' -e '\''s/^[BCDEGRST] \([^ ]*\) \([^ ]*\)$/ {"\2", (lt_ptr) \&\2},/p'\'''
lt_cv_sys_global_symbol_to_cdecl='sed -n -e '\''s/^. .* \(.*\)$/extern int \1;/p'\'''
lt_cv_sys_max_cmd_len=32768
lt_lt_cv_prog_compiler_c_o='"yes"'
lt_lt_cv_prog_compiler_c_o_CXX='"no"'
lt_lt_cv_sys_global_symbol_pipe='"sed -n -e '\''s/^.*[ ]\\([ABCDGISTW][ABCDGISTW]*\\)[ ][ ]*\\(\\)\\([_A-Za-z][_A-Za-z0-9]*\\)\$/\\1 \\2\\3 \\3/p'\''"'
lt_lt_cv_sys_global_symbol_to_c_name_address='"sed -n -e '\''s/^: \\([^ ]*\\) \$/ {\\\"\\1\\\", (lt_ptr) 0},/p'\'' -e '\''s/^[BCDEGRST] \\([^ ]*\\) \\([^ ]*\\)\$/ {\"\\2\", (lt_ptr) \\&\\2},/p'\''"'
lt_lt_cv_sys_global_symbol_to_cdecl='"sed -n -e '\''s/^. .* \\(.*\\)\$/extern int \\1;/p'\''"'

## ----------------- ##
## Output variables. ##
## ----------------- ##

ACLOCAL='${SHELL} /daten/kdesvn/kde35src/arts/admin/missing --run aclocal-1.9'
ALLOCA=''
AMDEPBACKSLASH='\'
AMDEP_FALSE='#'
AMDEP_TRUE=''
AMTAR='${SHELL} /daten/kdesvn/kde35src/arts/admin/missing --run tar'
AR='ar'
ARTS_MAJOR_VERSION='1'
ARTS_MICRO_VERSION='1'
ARTS_MINOR_VERSION='5'
ARTS_VERSION='1.5.1'
AUTOCONF='$(SHELL) $(top_srcdir)/admin/cvs.sh configure || touch configure'
AUTODIRS=''
AUTOHEADER='${SHELL} /daten/kdesvn/kde35src/arts/admin/missing --run autoheader'
AUTOMAKE='${SHELL} /daten/kdesvn/kde35src/arts/admin/missing --run automake-1.9'
AWK='gawk'
CC='gcc'
CCDEPMODE='depmode=gcc3'
CFLAGS='-std=iso9899:1990 -W -Wall -Wchar-subscripts -Wshadow -Wpointer-arith -Wmissing-prototypes -Wwrite-strings -D_XOPEN_SOURCE=500 -D_BSD_SOURCE -g -O2 -fno-schedule-insns -fno-inline -Wformat-security -Wmissing-format-attribute'
CONF_FILES=' $(top_srcdir)/configure.in.in $(top_srcdir)/./flow/gsl/configure.in.in $(top_srcdir)/configure.in.bot'
CONVENIENCE_LTDL_FALSE='#'
CONVENIENCE_LTDL_TRUE=''
CPP='gcc -E'
CPPFLAGS=''
CXX='g++'
CXXCPP='g++ -E'
CXXDEPMODE='depmode=gcc3'
CXXFLAGS='-ansi -D_XOPEN_SOURCE=500 -D_BSD_SOURCE -Wcast-align -Wconversion -Wchar-subscripts -Wall -W -Wpointer-arith -pipe -march=athlon-xp -m3dnow'
CYGPATH_W='echo'
DEFS=''
DEPDIR='.deps'
ECHO='echo'
ECHO_C=''
ECHO_N='-n'
ECHO_T=''
EGREP='grep -E'
ENABLE_PERMISSIVE_FLAG=''
EXEEXT=''
EXTRA_SUBDIRS=''
F77=''
FFLAGS=''
FRAMEWORK_COREAUDIO=''
GLIB_CFLAGS=''
GLIB_LDFLAGS=''
GLIB_LIBADD=''
GSL_CFLAGS=''
GSL_HAVE_LIBMAD=''
GSL_HAVE_MUTEXATTR_SETTYPE=''
GSL_HAVE_OGGVORBIS=''
GSL_HAVE_OGGVORBIS_RC3=''
GSL_LIBS=''
GSL_SIZEOF_PTH_COND_T=''
GSL_SIZEOF_PTH_MUTEX_T=''
GSL_SIZEOF_STD_INTMAX_T=''
GSL_USE_ARTS_THREADS=''
GSL_USE_GSL_GLIB=''
HAVE_GCC_VISIBILITY='0'
HAVE_LIBJPEG_FALSE=''
HAVE_LIBJPEG_TRUE=''
HAVE_LIBPNG_FALSE=''
HAVE_LIBPNG_TRUE=''
HAVE_LIBTIFF_FALSE=''
HAVE_LIBTIFF_TRUE=''
HAVE_WAVSUPPORT_FALSE=''
HAVE_WAVSUPPORT_TRUE=''
INSTALL_DATA='${INSTALL} -m 644'
INSTALL_LTDL_FALSE=''
INSTALL_LTDL_TRUE='#'
INSTALL_PROGRAM='${INSTALL} $(INSTALL_STRIP_FLAG)'
INSTALL_SCRIPT='${INSTALL}'
INSTALL_STRIP_PROGRAM='${SHELL} $(install_sh) -c -s'
JACK_CFLAGS=''
JACK_LDFLAGS=''
JACK_LIBADD=''
KDE_CHECK_PLUGIN='$(KDE_PLUGIN) -rpath $(libdir)'
KDE_EXTRA_RPATH=''
KDE_INCLUDES=''
KDE_LDFLAGS=''
KDE_MT_LDFLAGS=''
KDE_MT_LIBS=''
KDE_NO_UNDEFINED=''
KDE_PLUGIN='-avoid-version -module -no-undefined $(KDE_NO_UNDEFINED) $(KDE_RPATH) $(KDE_MT_LDFLAGS)'
KDE_RPATH=''
KDE_USE_CLOSURE_FALSE=''
KDE_USE_CLOSURE_TRUE='#'
KDE_USE_FINAL_FALSE=''
KDE_USE_FINAL_TRUE='#'
KDE_USE_FPIE=''
KDE_USE_NMCHECK_FALSE=''
KDE_USE_NMCHECK_TRUE='#'
KDE_USE_PIE=''
LDFLAGS=''
LDFLAGS_AS_NEEDED=''
LDFLAGS_NEW_DTAGS=''
LIBADD_DL='-ldl'
LIBASOUND=''
LIBAUDIOFILE=''
LIBAUDIOFILE_LDFLAGS=''
LIBAUDIOIO=''
LIBAUDIONAS=''
LIBAUDIONAS_LDFLAGS=''
LIBCOMPAT=''
LIBCRYPT='-lcrypt'
LIBCSL=''
LIBDL='-ldl'
LIBESD=''
LIBESD_LDFLAGS=''
LIBICE=''
LIBJPEG=''
LIBMAS=''
LIBOBJS=''
LIBOSSAUDIO=''
LIBPNG=''
LIBPOSIX4=''
LIBPTHREAD=''
LIBRESOLV='-lresolv'
LIBS=''
LIBSEM=''
LIBSM=''
LIBSOCKET=''
LIBTOOL='$(SHELL) $(top_builddir)/libtool --silent'
LIBUCB=''
LIBUTIL='-lutil'
LIBZ=''
LIB_POLL=''
LIB_QPE=''
LIB_QT=''
LIB_X11=''
LIB_XEXT=''
LIB_XRENDER=''
LN_S='ln -s'
LTLIBOBJS=''
MAKEINFO='${SHELL} /daten/kdesvn/kde35src/arts/admin/missing --run makeinfo'
MAS_CFLAGS=''
MAS_CONFIG=''
MAS_LDFLAGS=''
MCOPIDL=''
MOC=''
NOOPT_CFLAGS='-O0'
NOOPT_CXXFLAGS=''
OBJEXT='o'
PACKAGE='arts'
PACKAGE_BUGREPORT=''
PACKAGE_NAME=''
PACKAGE_STRING=''
PACKAGE_TARNAME=''
PACKAGE_VERSION=''
PATH_SEPARATOR=':'
PERL=''
PKG_CONFIG=''
QTE_NORTTI=''
QT_INCLUDES=''
QT_LDFLAGS=''
RANLIB='ranlib'
SET_MAKE=''
SGILIBAUDIO=''
SHELL='/bin/sh'
STRIP='strip'
TOPSUBDIRS=''
UIC=''
UIC_TR=''
USER_INCLUDES=''
USER_LDFLAGS=''
USE_EXCEPTIONS=''
USE_RTTI=''
USE_THREADS=''
VERSION='1.5.1'
WOVERLOADED_VIRTUAL=''
X_EXTRA_LIBS=''
X_INCLUDES=''
X_LDFLAGS=''
X_PRE_LIBS=''
X_RPATH=''
ac_ct_AR='ar'
ac_ct_CC='gcc'
ac_ct_CXX='g++'
ac_ct_F77=''
ac_ct_RANLIB='ranlib'
ac_ct_STRIP='strip'
all_includes=''
all_libraries=''
am__fastdepCC_FALSE='#'
am__fastdepCC_TRUE=''
am__fastdepCXX_FALSE='#'
am__fastdepCXX_TRUE=''
am__include='include'
am__leading_dot='.'
am__quote=''
am__tar='${AMTAR} chof - "$$tardir"'
am__untar='${AMTAR} xf -'
artsc_SUBDIR_included_FALSE=''
artsc_SUBDIR_included_TRUE=''
bindir='${exec_prefix}/bin'
build='x86_64-unknown-linux-gnu'
build_alias=''
build_cpu='x86_64'
build_os='linux-gnu'
build_vendor='unknown'
datadir='${prefix}/share'
doc_SUBDIR_included_FALSE=''
doc_SUBDIR_included_TRUE=''
examples_SUBDIR_included_FALSE=''
examples_SUBDIR_included_TRUE=''
exec_prefix='NONE'
flow_SUBDIR_included_FALSE=''
flow_SUBDIR_included_TRUE=''
gmcop_SUBDIR_included_FALSE=''
gmcop_SUBDIR_included_TRUE=''
host='x86_64-unknown-linux-gnu'
host_alias=''
host_cpu='x86_64'
host_os='linux-gnu'
host_vendor='unknown'
include_x11_FALSE=''
include_x11_TRUE=''
includedir='${prefix}/include'
infodir='${prefix}/info'
install_sh='/daten/kdesvn/kde35src/arts/admin/install-sh'
kde_includes=''
kde_libraries=''
kde_libs_htmldir='$(kde_htmldir)'
kde_libs_prefix='$(prefix)'
kde_qtver='3'
libdir='${exec_prefix}/lib64'
libexecdir='${exec_prefix}/libexec'
libltdl_SUBDIR_included_FALSE=''
libltdl_SUBDIR_included_TRUE=''
localstatedir='${prefix}/var'
mandir='${prefix}/man'
mcop_SUBDIR_included_FALSE=''
mcop_SUBDIR_included_TRUE=''
mcop_mt_SUBDIR_included_FALSE=''
mcop_mt_SUBDIR_included_TRUE=''
mcopidl_SUBDIR_included_FALSE=''
mcopidl_SUBDIR_included_TRUE=''
mkdir_p='mkdir -p --'
oldincludedir='/usr/include'
prefix='/daten/kdesvn/kde35'
program_transform_name='s,x,x,'
qt_includes=''
qt_libraries=''
qtmcop_SUBDIR_included_FALSE=''
qtmcop_SUBDIR_included_TRUE=''
sbindir='${exec_prefix}/sbin'
sharedstatedir='${prefix}/com'
soundserver_SUBDIR_included_FALSE=''
soundserver_SUBDIR_included_TRUE=''
sysconfdir='${prefix}/etc'
target='x86_64-unknown-linux-gnu'
target_alias=''
target_cpu='x86_64'
target_os='linux-gnu'
target_vendor='unknown'
tests_SUBDIR_included_FALSE=''
tests_SUBDIR_included_TRUE=''
unsermake_enable_pch_FALSE=''
unsermake_enable_pch_TRUE='#'
x11_SUBDIR_included_FALSE=''
x11_SUBDIR_included_TRUE=''
x_includes='NONE'
x_libraries='NONE'

## ----------- ##
## confdefs.h. ##
## ----------- ##

#define HAVE_CRYPT 1
#define HAVE_CTYPE_H 1
#define HAVE_DLERROR 1
#define HAVE_DLFCN_H 1
#define HAVE_DLFCN_H 1
#define HAVE_INTTYPES_H 1
#define HAVE_LIBDL 1
#define HAVE_MALLOC_H 1
#define HAVE_MEMCPY 1
#define HAVE_MEMORY_H 1
#define HAVE_MEMORY_H 1
#define HAVE_PRELOADED_SYMBOLS 1
#define HAVE_RES_INIT 1
#define HAVE_SNPRINTF 1
#define HAVE_STDINT_H 1
#define HAVE_STDINT_H 1
#define HAVE_STDIO_H 1
#define HAVE_STDLIB_H 1
#define HAVE_STDLIB_H 1
#define HAVE_STRCHR 1
#define HAVE_STRCMP 1
#define HAVE_STRINGS_H 1
#define HAVE_STRING_H 1
#define HAVE_STRING_H 1
#define HAVE_STRRCHR 1
#define HAVE_SYS_BITYPES_H 1
#define HAVE_SYS_STAT_H 1
#define HAVE_SYS_TYPES_H 1
#define HAVE_SYS_TYPES_H 1
#define HAVE_UNISTD_H 1
#define HAVE_VSNPRINTF 1
#define KDELIBSUFF "64"
#define LTDL_OBJDIR ".libs/"
#define LTDL_SHLIBPATH_VAR "LD_LIBRARY_PATH"
#define LTDL_SYSSEARCHPATH "/lib64:/usr/lib64"
#define PACKAGE "arts"
#define PACKAGE_BUGREPORT ""
#define PACKAGE_NAME ""
#define PACKAGE_STRING ""
#define PACKAGE_TARNAME ""
#define PACKAGE_VERSION ""
#define SIZEOF_CHAR_P 8
#define SIZEOF_INT 4
#define SIZEOF_LONG 8
#define SIZEOF_SHORT 2
#define SIZEOF_SIZE_T 8
#define SIZEOF_UNSIGNED_LONG 8
#define STDC_HEADERS 1
#define VERSION "1.5.1"
#define kde_socklen_t int
#define ksize_t int
#endif
#ifdef __cplusplus
void exit (int);

configure: exit 1

--Boundary-00=_8dM8DFzYIFtZqvH
Content-Type: text/plain; charset="us-ascii"
MIME-Version: 1.0
Content-Transfer-Encoding: 7bit
Content-Disposition: inline


>> Visit http://mail.kde.org/mailman/listinfo/kde-devel#unsub to unsubscribe <<


--Boundary-00=_8dM8DFzYIFtZqvH--