--YZ5djTAD1cGYuMQK
Content-Type: text/plain; charset=us-ascii
Content-Disposition: inline
Content-Transfer-Encoding: quoted-printable

FYI; can you please investigate and/or report to the developers? If
you are already aware of this problem but do not yet have a fix,
please mark the port BROKEN in the appropriate case, so that users do
not unexpectedly encounter it.

See http://pointyhat.freebsd.org for the full log.

Thanks,
Kris

----- Forwarded message from User Ports-i386 -----

X-Original-To: kkenn@localhost
Delivered-To: kkenn@localhost.obsecurity.org
X-Original-To: kris@FreeBSD.org
Delivered-To: kris@FreeBSD.org
Date: Sat, 4 Nov 2006 00:53:50 GMT
From: User Ports-i386
To: kris@FreeBSD.org
Subject: py24-cairo-1.2.2 failed on i386 4
X-UIDL: \%$"!>B&#!?_a!!M\=3D"!
X-Bogosity: Ham, tests=3Dbogofilter, spamicity=3D0.000000, version=3D1.0.3

building py24-cairo-1.2.2 on gohan17.freebsd.org
in directory /x/tmp/4/chroot/54031
building for: 4.11-STABLE i386
maintained by: gnome@FreeBSD.org
port directory: /usr/ports/graphics/py-cairo
build started at Sat Nov 4 00:51:56 GMT 2006
FETCH_DEPENDS=3D
PATCH_DEPENDS=3D
EXTRACT_DEPENDS=3D
BUILD_DEPENDS=3DXFree86-libraries-4.5.0.tgz cairo-1.2.6.tgz expat-2.0.0_1.t=
gz fontconfig-2.3.2_6,1.tgz freetype2-2.2.1_1.tgz gettext-0.14.5_2.tgz gmak=
e-3.81_1.tgz ldconfig_compat-1.0_8.tgz libiconv-1.9.2_2.tgz pkg-config-0.21=
..tgz png-1.2.12_1.tgz py24-numeric-24.2.tgz python24-2.4.3_3.tgz rc_subr-1.=
31_1.tgz
RUN_DEPENDS=3DXFree86-libraries-4.5.0.tgz cairo-1.2.6.tgz expat-2.0.0_1.tgz=
fontconfig-2.3.2_6,1.tgz freetype2-2.2.1_1.tgz ldconfig_compat-1.0_8.tgz p=
kg-config-0.21.tgz png-1.2.12_1.tgz py24-numeric-24.2.tgz python24-2.4.3_3.=
tgz rc_subr-1.31_1.tgz
prefixes: LOCALBASE=3Dusr/local X11BASE=3Dusr/X11R6
add_pkg
=3D=3D=3D=3D=3D=3D=3D=3D=3D=3D=3D=3D=3D=3D=3D=3D=3 D=3D=3D=3D=3D=3D=3D=3D=3D=
=3D=3D=3D=3D=3D=3D=3D=3D=3D=3D=3D=3D=3D=3D=3D=3D=3 D=3D=3D=3D=3D=3D=3D=3D=3D=
=3D=3D=3D=3D=3D=3D=3D=3D=3D=3D=3D=3D=3D=3D
=3D=3D=3D=3D=3D=3D=3D=3D=3D=3D=3D=3D=3D=3D=3D=3D=3 D=3D=3D=3D checksum>=3D=3D=3D=3D=3D=3D=3D=3D=3D=3D=3D=3D=3D=3D=3D=3D=3 D=3D=3D=3D
=3D> pycairo-1.2.2.tar.gz doesn't seem to exist in /tmp/distfiles/.
=3D> Attempting to fetch from ftp://ftp-master.freebsd.org/pub/FreeBSD/port=
s/distfiles/.
pycairo-1.2.2.tar.gz 471 kB 2337 kBps
=3D> MD5 Checksum OK for pycairo-1.2.2.tar.gz.
=3D=3D=3D=3D=3D=3D=3D=3D=3D=3D=3D=3D=3D=3D=3D=3D=3 D=3D=3D=3D=3D=3D=3D=3D=3D=
=3D=3D=3D=3D=3D=3D=3D=3D=3D=3D=3D=3D=3D=3D=3D=3D=3 D=3D=3D=3D=3D=3D=3D=3D=3D=
=3D=3D=3D=3D=3D=3D=3D=3D=3D=3D=3D=3D=3D=3D
=3D=3D=3D=3D=3D=3D=3D=3D=3D=3D=3D=3D=3D=3D=3D=3D=3 D=3D=3D=3D extract>=3D=3D=3D=3D=3D=3D=3D=3D=3D=3D=3D=3D=3D=3D=3D=3D=3 D=3D=3D=3D
add_pkg
=3D=3D=3D> Extracting for py24-cairo-1.2.2
=3D> MD5 Checksum OK for pycairo-1.2.2.tar.gz.
=3D=3D=3D=3D=3D=3D=3D=3D=3D=3D=3D=3D=3D=3D=3D=3D=3 D=3D=3D=3D=3D=3D=3D=3D=3D=
=3D=3D=3D=3D=3D=3D=3D=3D=3D=3D=3D=3D=3D=3D=3D=3D=3 D=3D=3D=3D=3D=3D=3D=3D=3D=
=3D=3D=3D=3D=3D=3D=3D=3D=3D=3D=3D=3D=3D=3D
=3D=3D=3D=3D=3D=3D=3D=3D=3D=3D=3D=3D=3D=3D=3D=3D=3 D=3D=3D=3D patch>=3D=3D=3D=3D=3D=3D=3D=3D=3D=3D=3D=3D=3D=3D=3D=3D=3 D=3D=3D=3D
add_pkg
=3D=3D=3D> Patching for py24-cairo-1.2.2
=3D=3D=3D=3D=3D=3D=3D=3D=3D=3D=3D=3D=3D=3D=3D=3D=3 D=3D=3D=3D=3D=3D=3D=3D=3D=
=3D=3D=3D=3D=3D=3D=3D=3D=3D=3D=3D=3D=3D=3D=3D=3D=3 D=3D=3D=3D=3D=3D=3D=3D=3D=
=3D=3D=3D=3D=3D=3D=3D=3D=3D=3D=3D=3D=3D=3D
=3D=3D=3D=3D=3D=3D=3D=3D=3D=3D=3D=3D=3D=3D=3D=3D=3 D=3D=3D=3D build>=3D=3D=3D=3D=3D=3D=3D=3D=3D=3D=3D=3D=3D=3D=3D=3D=3 D=3D=3D=3D
add_pkg XFree86-libraries-4.5.0.tgz cairo-1.2.6.tgz expat-2.0.0_1.tgz fontc=
onfig-2.3.2_6,1.tgz freetype2-2.2.1_1.tgz gettext-0.14.5_2.tgz gmake-3.81_1=
..tgz ldconfig_compat-1.0_8.tgz libiconv-1.9.2_2.tgz pkg-config-0.21.tgz png=
-1.2.12_1.tgz py24-numeric-24.2.tgz python24-2.4.3_3.tgz rc_subr-1.31_1.tgz
adding dependencies
pkg_add XFree86-libraries-4.5.0.tgz
Running fc-cache to build fontconfig cache...
fc-cache: "/usr/X11R6/lib/X11/fonts": caching, 0 fonts, 1 dirs
fc-cache: "/usr/X11R6/lib/X11/fonts/local": caching, 0 fonts, 0 dirs
fc-cache: "/root/.fonts": skipping, no such directory
fc-cache: succeeded
pkg_add cairo-1.2.6.tgz
pkg_add expat-2.0.0_1.tgz
skipping expat-2.0.0_1, already added
pkg_add fontconfig-2.3.2_6,1.tgz
skipping fontconfig-2.3.2_6,1, already added
pkg_add freetype2-2.2.1_1.tgz
skipping freetype2-2.2.1_1, already added
pkg_add gettext-0.14.5_2.tgz
pkg_add gmake-3.81_1.tgz
pkg_add ldconfig_compat-1.0_8.tgz
skipping ldconfig_compat-1.0_8, already added
pkg_add libiconv-1.9.2_2.tgz
skipping libiconv-1.9.2_2, already added
pkg_add pkg-config-0.21.tgz
skipping pkg-config-0.21, already added
pkg_add png-1.2.12_1.tgz
skipping png-1.2.12_1, already added
pkg_add py24-numeric-24.2.tgz

=3D=3D=3D=3D
Note that some of the standard modules are provided as separate
ports since they require extra dependencies:

bsddb databases/py-bsddb
gdbm databases/py-gdbm
tkinter x11-toolkits/py-tkinter

Install them as needed.
=3D=3D=3D=3D

pkg_add python24-2.4.3_3.tgz
skipping python24-2.4.3_3, already added
pkg_add rc_subr-1.31_1.tgz
skipping rc_subr-1.31_1, already added
=3D=3D=3D> py24-cairo-1.2.2 depends on file: /usr/local/lib/python2.4/sit=
e-packages/Numeric/Numeric.py - found
=3D=3D=3D> py24-cairo-1.2.2 depends on file: /usr/local/bin/python - found
=3D=3D=3D> py24-cairo-1.2.2 depends on executable in : gmake - found
=3D=3D=3D> py24-cairo-1.2.2 depends on shared library: cairo.2 - found
=3D=3D=3D> Configuring for py24-cairo-1.2.2
checking for a BSD-compatible install... /usr/bin/install -c -o root -g whe=
el
checking whether build environment is sane... yes
checking for gawk... no
checking for mawk... no
checking for nawk... nawk
checking whether gmake sets $(MAKE)... yes
checking build system type... i386-portbld-freebsd4.11
checking host system type... i386-portbld-freebsd4.11
checking for style of include used by gmake... GNU
checking for gcc... cc
checking for C compiler default output file name... a.out
checking whether the C compiler works... yes
checking whether we are cross compiling... no
checking for suffix of executables...=20
checking for suffix of object files... o
checking whether we are using the GNU C compiler... yes
checking whether cc accepts -g... yes
checking for cc option to accept ANSI C... none needed
checking dependency style of cc... gcc
checking for a sed that does not truncate output... /usr/bin/sed
checking for egrep... grep -E
checking for ld used by cc... /usr/libexec/elf/ld
checking if the linker (/usr/libexec/elf/ld) is GNU ld... yes
checking for /usr/libexec/elf/ld option to reload object files... -r
checking for BSD-compatible nm... /usr/bin/nm -B
checking whether ln -s works... yes
checking how to recognise dependent libraries... pass_all
checking how to run the C preprocessor... cc -E
checking for ANSI C header files... yes
checking for sys/types.h... yes
checking for sys/stat.h... yes
checking for stdlib.h... yes
checking for string.h... yes
checking for memory.h... yes
checking for strings.h... yes
checking for inttypes.h... yes
checking for stdint.h... no
checking for unistd.h... yes
checking dlfcn.h usability... yes
checking dlfcn.h presence... yes
checking for dlfcn.h... yes
checking whether we are using the GNU C++ compiler... yes
checking whether c++ accepts -g... yes
checking dependency style of c++... gcc
checking how to run the C++ preprocessor... c++ -E
checking for g77... no
checking for f77... f77
checking whether we are using the GNU Fortran 77 compiler... yes
checking whether f77 accepts -g... yes
checking the maximum length of command line arguments... (cached) 262144
checking command to parse /usr/bin/nm -B output from cc object... ok
checking for objdir... .libs
checking for ar... ar
checking for ranlib... ranlib
checking for strip... strip
checking if cc supports -fno-rtti -fno-exceptions... yes
checking for cc option to produce PIC... -fPIC
checking if cc PIC flag -fPIC works... yes
checking if cc static flag -static works... yes
checking if cc supports -c -o file.o... yes
checking whether the cc linker (/usr/libexec/elf/ld) supports shared librar=
ies... yes
checking whether -lc should be explicitly linked in... yes
checking dynamic linker characteristics... freebsd4.11 ld.so
checking how to hardcode library paths into programs... immediate
checking whether stripping libraries is possible... yes
checking if libtool supports shared libraries... yes
checking whether to build shared libraries... yes
checking whether to build static libraries... no
configure: creating libtool
appending configuration tag "CXX" to libtool
checking for ld used by c++... /usr/libexec/elf/ld
checking if the linker (/usr/libexec/elf/ld) is GNU ld... yes
checking whether the c++ linker (/usr/libexec/elf/ld) supports shared libra=
ries... yes
checking for c++ option to produce PIC... -fPIC
checking if c++ PIC flag -fPIC works... yes
checking if c++ static flag -static works... yes
checking if c++ supports -c -o file.o... yes
checking whether the c++ linker (/usr/libexec/elf/ld) supports shared libra=
ries... yes
checking dynamic linker characteristics... freebsd4.11 ld.so
checking how to hardcode library paths into programs... immediate
appending configuration tag "F77" to libtool
checking if libtool supports shared libraries... yes
checking whether to build shared libraries... yes
checking whether to build static libraries... no
checking for f77 option to produce PIC... -fPIC
checking if f77 PIC flag -fPIC works... yes
checking if f77 static flag -static works... no
checking if f77 supports -c -o file.o... yes
checking whether the f77 linker (/usr/libexec/elf/ld) supports shared libra=
ries... yes
checking dynamic linker characteristics... freebsd4.11 ld.so
checking how to hardcode library paths into programs... immediate
checking for a Python interpreter with version >=3D 2.3... python
checking for python... /usr/local/bin/python
checking for python version... 2.4
checking for python platform... freebsd4
checking for python script directory... ${prefix}/lib/python2.4/site-packag=
es
checking for python extension module directory... ${exec_prefix}/lib/python=
2.4/site-packages
checking for pkg-config... /usr/local/bin/pkg-config
checking pkg-config is at least version 0.9.0... yes
checking for CAIRO... yes
checking for headers required to compile python extensions... found
checking for Numeric/arrayobject.h... yes
checking for an ANSI C-conforming const... yes
checking whether cc accepts -fno-strict-aliasing... yes
configure: creating ./config.status
config.status: creating Makefile
config.status: creating pycairo.pc
config.status: creating cairo/Makefile
config.status: creating examples/Makefile
config.status: creating test/Makefile
config.status: creating config.h
config.status: executing depfiles commands

Configuration:
Installation prefix /usr/local

Additional modules:
build cairo.gtk? no
build Numeric support? yes

=3D=3D=3D> Building for py24-cairo-1.2.2
gmake all-recursive
gmake[1]: Entering directory `/work/a/ports/graphics/py-cairo/work/pycairo-=
1.2.2'
Making all in cairo
gmake[2]: Entering directory `/work/a/ports/graphics/py-cairo/work/pycairo-=
1.2.2/cairo'
source=3D'pycairo-context.c' object=3D'_cairo_la-pycairo-context.lo' libtoo=
l=3Dyes \
DEPDIR=3D.deps depmode=3Dgcc /bin/sh ../depcomp \
/bin/sh ../libtool --tag=3DCC --mode=3Dcompile cc -DHAVE_CONFIG_H -I. -I. =
-I.. -I/usr/local/include/python2.4 -I/usr/local/include/cairo -I/usr/loca=
l/include/freetype2 -I/usr/local/include -I/usr/X11R6/include -I/usr/X11R=
6/include -O -pipe -Wall -fno-strict-aliasing -c -o _cairo_la-pycairo-con=
text.lo `test -f 'pycairo-context.c' || echo './'`pycairo-context.c
mkdir .libs
cc -DHAVE_CONFIG_H -I. -I. -I.. -I/usr/local/include/python2.4 -I/usr/loca=
l/include/cairo -I/usr/local/include/freetype2 -I/usr/local/include -I/usr/=
X11R6/include -I/usr/X11R6/include -O -pipe -Wall -fno-strict-aliasing -c p=
ycairo-context.c -Wp,-MD,.deps/_cairo_la-pycairo-context.TPlo -fPIC -DPIC =
-o .libs/_cairo_la-pycairo-context.o
source=3D'pycairo-font.c' object=3D'_cairo_la-pycairo-font.lo' libtool=3Dye=
s \
DEPDIR=3D.deps depmode=3Dgcc /bin/sh ../depcomp \
/bin/sh ../libtool --tag=3DCC --mode=3Dcompile cc -DHAVE_CONFIG_H -I. -I. =
-I.. -I/usr/local/include/python2.4 -I/usr/local/include/cairo -I/usr/loca=
l/include/freetype2 -I/usr/local/include -I/usr/X11R6/include -I/usr/X11R=
6/include -O -pipe -Wall -fno-strict-aliasing -c -o _cairo_la-pycairo-fon=
t.lo `test -f 'pycairo-font.c' || echo './'`pycairo-font.c
cc -DHAVE_CONFIG_H -I. -I. -I.. -I/usr/local/include/python2.4 -I/usr/loca=
l/include/cairo -I/usr/local/include/freetype2 -I/usr/local/include -I/usr/=
X11R6/include -I/usr/X11R6/include -O -pipe -Wall -fno-strict-aliasing -c p=
ycairo-font.c -Wp,-MD,.deps/_cairo_la-pycairo-font.TPlo -fPIC -DPIC -o .li=
bs/_cairo_la-pycairo-font.o
pycairo-font.c: In function `scaled_font_new':
pycairo-font.c:208: syntax error before `*'
pycairo-font.c:209: `o' undeclared (first use in this function)
pycairo-font.c:209: (Each undeclared identifier is reported only once
pycairo-font.c:209: for each function it appears in.)
pycairo-font.c:221: warning: control reaches end of non-void function
gmake[2]: *** [_cairo_la-pycairo-font.lo] Error 1
gmake[2]: Leaving directory `/work/a/ports/graphics/py-cairo/work/pycairo-1=
..2.2/cairo'
gmake[1]: *** [all-recursive] Error 1
gmake[1]: Leaving directory `/work/a/ports/graphics/py-cairo/work/pycairo-1=
..2.2'
gmake: *** [all] Error 2
*** Error code 2

Stop in /a/ports/graphics/py-cairo.
=3D=3D=3D=3D=3D=3D=3D=3D=3D=3D=3D=3D=3D=3D=3D=3D=3 D=3D=3D=3D=3D=3D=3D=3D=3D=
=3D=3D=3D=3D=3D=3D=3D=3D=3D=3D=3D=3D=3D=3D=3D=3D=3 D=3D=3D=3D=3D=3D=3D=3D=3D=
=3D=3D=3D=3D=3D=3D=3D=3D=3D=3D=3D=3D=3D=3D
build of /usr/ports/graphics/py-cairo ended at Sat Nov 4 00:53:42 GMT 2006


----- End forwarded message -----

--YZ5djTAD1cGYuMQK
Content-Type: application/pgp-signature
Content-Disposition: inline

-----BEGIN PGP SIGNATURE-----
Version: GnuPG v1.4.5 (FreeBSD)

iD8DBQFFS/DKWry0BWjoQKURAqbuAJ936Msi8A+nVQe0lIagSuPeXjjNyACe J1W/
EtAu5qjy7P1F9Qo3huwBbsA=
=XHXz
-----END PGP SIGNATURE-----

--YZ5djTAD1cGYuMQK--